program: Gaussian 16
title: Title
version: ES64L-G16RevA.03
method: RPBE1PBE
basis: def2SVP
operation: Freq
keyword: #N
keyword: Geom=AllCheck
keyword: Guess=TCheck
keyword: SCRF=Check
keyword: GenChk
keyword: RPBE1PBE/def2SVP
keyword: Freq
converged: YES YES NO NO
title: Mulliken charges:
elementType: Pd P C C C C H C H C H H H C C C C H C H C H H H C C C C H C H C H H H P C C C C H C H C H H H C C C C H C H C H H H C C C C H C H C H H H C C C C C H H H H H N C O O C C C C H C H C H H H C H H H C C C C C C H H H H H H H H H
charge: -0.175648 0.370456 -0.161746 -0.012274 -0.006565 -0.018117 0.068226 -0.023289 0.052920 -0.016510 0.043629 0.046955 0.048773 -0.176372 0.000791 -0.031333 -0.012774 0.046446 -0.015430 0.060912 -0.017171 0.042224 0.045908 0.048841 -0.150994 -0.006069 -0.009349 -0.020224 0.046210 -0.009672 0.046320 -0.016606 0.048094 0.045151 0.050188 0.369263 -0.163951 -0.011845 -0.039950 -0.022300 0.047956 -0.023435 0.078624 -0.013323 0.043399 0.050700 0.043587 -0.154501 -0.028702 -0.011176 -0.026571 0.040216 -0.016959 0.044373 -0.020410 0.044048 0.041606 0.045988 -0.183127 -0.015858 -0.042392 -0.019039 0.055151 -0.013380 0.081525 -0.013246 0.048122 0.044469 0.050363 0.001624 0.106617 -0.028247 -0.155594 0.050088 0.069057 0.080217 0.106762 0.115374 0.047813 -0.330333 0.406803 -0.333687 -0.292231 0.149648 -0.017524 -0.023503 -0.039257 0.036977 -0.040932 0.040946 -0.018156 0.047393 0.046717 0.043612 0.022419 0.056497 0.058858 0.060280 0.038871 -0.121226 -0.228763 0.038554 -0.050889 -0.049915 0.113998 0.071790 0.068199 0.067791 0.046077 0.049383 0.046843 0.045430 0.054494
chargesum: 1.00000
title: Mulliken charges with hydrogens summed into heavy atoms:
elementType: Pd P C C C C C C C C C C C C C C C C C C P C C C C C C C C C C C C C C C C C C C C C C C N C O O C C C C C C C C C C C C C
charge: -0.175648 0.370456 -0.161746 0.055952 0.046354 0.025512 0.023665 0.032263 -0.176372 0.047237 0.029579 0.029449 0.030478 0.031670 -0.150994 0.040141 0.036972 0.027870 0.035479 0.033581 0.369263 -0.163951 0.036112 0.038675 0.021100 0.027264 0.030264 -0.154501 0.011514 0.033197 0.017477 0.024646 0.025579 -0.183127 0.039294 0.039133 0.029084 0.031089 0.037117 0.070682 0.186835 0.078515 -0.040220 0.097900 -0.330333 0.406803 -0.333687 -0.292231 0.149648 0.019454 0.017442 0.008136 0.005784 0.025456 0.198054 0.165155 -0.007228 -0.228763 0.174543 0.044571 0.042357
1716.lowfreq: -7.0405 -2.4828 -0.0010 -0.0003 0.0007 4.1736 6.4866 14.2131 21.2018
redmass: 5.4212 4.8519 5.3046 4.9707 4.9229 5.0750 4.4145 5.4504 4.9547 4.9845 5.2682 6.0476 5.1242 5.3585 5.3003 5.5422 5.2516 4.3381 4.9532 4.6829 7.1070 4.8240 4.2180 5.4997 5.8479 4.1715 6.9609 4.3613 4.2492 4.6969 3.1505 4.3690 4.6830 3.4229 5.8274 5.8167 5.5493 4.5028 4.9566 5.1443 4.2350 2.1076 4.9165 2.8982 2.7856 2.3043 4.7409 5.1402 5.2528 4.2040 3.5015 4.7296 4.9527 4.9020 2.2618 2.6854 3.9769 5.8288 2.8405 3.1852 3.2537 2.9918 2.8962 2.9504 3.2320 3.4878 4.1369 7.1485 4.9730 6.3251 3.3533 5.5761 4.0505 3.5425 4.2178 4.8062 5.2975 3.6514 4.4960 4.1684 3.7430 4.6935 4.8062 3.1894 6.6459 3.7656 6.3230 6.3748 6.3618 6.3737 6.3725 6.3773 6.3389 4.1547 3.9821 6.3917 5.9281 2.9783 1.8247 4.9908 1.8768 1.9118 2.0054 3.1050 2.3308 6.1790 1.8156 3.6944 1.8327 1.6863 3.4854 1.7615 1.8463 1.8675 2.3407 1.9708 1.9644 1.4891 2.7220 1.4705 3.5296 1.2921 1.5497 3.2935 1.2821 1.2521 1.2499 1.2537 3.1351 1.2456 1.2629 2.3306 1.4810 2.1438 1.6466 1.3545 1.5181 1.3484 1.3434 1.3548 1.4018 1.6879 1.4781 1.6724 2.4227 1.3699 1.3138 1.4226 3.2322 2.7329 1.5692 3.5394 2.3201 2.4389 2.7197 3.6444 4.5014 5.2237 1.5092 1.3606 1.3274 1.3155 1.3289 1.3323 1.3429 1.3379 1.2998 1.9926 2.0519 2.2207 2.3585 2.4017 2.4436 2.5387 2.3801 1.9757 1.7638 1.7240 1.3960 1.4338 1.4628 1.4158 1.4868 1.5256 1.4870 1.5297 2.2894 2.7815 2.9186 2.8327 2.8674 2.9300 2.8759 2.2441 1.1973 1.5692 1.0853 1.0781 1.0658 1.0639 1.0693 1.0647 1.0617 1.1281 1.5855 1.2655 1.2885 1.1158 1.1148 1.1133 1.1125 1.1133 1.6072 1.2721 2.4225 1.7481 1.7275 1.5159 1.3682 1.3808 1.3240 1.3171 1.3562 1.3727 1.3372 1.3567 1.4048 1.5897 1.6341 1.5607 1.6526 1.9133 1.7386 5.7918 3.0260 5.5364 2.1505 7.1089 7.0487 7.4746 5.2683 4.2947 1.2423 1.9216 1.0954 1.1053 1.0932 1.0979 1.1223 2.3862 2.3904 2.4039 2.3993 2.3124 2.4194 2.4374 2.5830 2.3311 2.2737 2.3146 2.2783 2.2851 2.2633 2.7652 6.3804 6.0882 6.1162 6.1822 6.2782 6.3165 6.3794 6.0766 6.2714 6.2913 6.3245 6.2875 6.2993 6.3240 6.8780 6.9119 12.6855 1.0719 1.0668 1.0366 1.0638 1.0646 1.0914 1.0874 1.1004 1.1021 1.1040 1.0878 1.1028 1.0904 1.1048 1.0908 1.0897 1.0886 1.0865 1.0867 1.0879 1.0877 1.0869 1.0869 1.0889 1.0879 1.0894 1.0894 1.0920 1.0904 1.0911 1.0925 1.0908 1.0922 1.0931 1.0936 1.0966 1.0941 1.0956 1.0966 1.0952 1.0958 1.0970 1.0982 1.0999 1.1006 1.1010 1.1003 1.0982 1.0985 1.0991 1.0980 1.0959
irintensity: 0.1389 0.0307 0.0748 0.0968 0.1074 0.0316 0.0705 0.1244 0.0726 0.0313 0.2701 0.8726 1.0457 0.3343 0.7935 0.2730 0.7042 0.3299 0.2258 0.8407 1.3026 0.3916 1.1451 0.8058 2.0763 0.2539 0.2403 0.3350 0.3542 1.8902 1.1296 0.8553 2.1677 2.3760 4.9047 3.9067 3.4818 0.1638 1.5391 1.7235 0.4469 6.4719 1.0536 1.0996 1.5127 0.8067 1.2497 3.0614 4.4635 1.6339 0.2311 0.2656 7.3201 3.0991 2.1333 13.1362 1.8497 9.6036 0.1068 6.7796 7.4031 3.1304 1.6181 0.7359 2.5507 7.6897 17.5053 11.1812 10.4865 13.5924 27.7781 21.5210 16.3772 19.5429 49.7397 39.5389 106.8410 56.1288 70.8966 59.8750 29.2281 152.8463 136.1292 18.1719 21.7947 8.2789 5.6589 0.9609 0.8424 0.2133 1.2150 2.9194 0.7893 14.9231 5.0813 5.6037 15.3784 9.4158 52.4284 38.9163 115.6582 36.3107 97.4419 31.1473 31.1741 23.1977 59.0484 27.0080 27.8351 29.5897 39.8047 23.2456 19.7930 2.1010 122.0491 15.1625 4.9067 46.4301 8.3872 11.5792 13.0562 10.5396 28.2467 27.0620 0.1786 0.8163 1.0191 1.4325 12.5760 1.8411 1.7657 32.5561 22.4877 8.2600 6.3567 1.8562 42.6222 0.1744 1.4921 0.1426 12.9761 5.7310 0.5847 19.6474 6.1667 0.2546 129.1928 0.4438 4.8596 2.3452 4.5554 3.7104 0.4613 8.7509 1.9659 2.0828 4.1562 13.1267 1.7109 1.1428 0.0489 0.6236 0.2463 0.3609 0.2506 0.7288 1.1107 78.1675 1.1590 16.1855 7.5666 6.7833 3.7086 13.4944 28.0391 46.9414 14.0021 0.8968 24.8012 4.7654 5.2227 4.5470 9.4750 8.2371 6.8454 8.2325 51.4875 36.7825 59.2170 28.8430 50.2276 67.7553 43.1094 39.2808 34.9268 15.9148 0.1043 0.1614 0.0641 0.3519 0.1049 0.6326 0.5280 2.4013 14.7002 18.6566 56.7102 5.3876 10.2088 2.8111 6.6600 2.7439 0.4670 7.0883 485.8915 222.6372 455.1200 241.7213 6.1880 9.4359 15.0159 3.1809 28.1694 1.2839 2.9791 9.8503 31.9986 154.3601 165.3692 20.6107 59.2828 122.3635 19.6877 0.9372 59.8957 0.9441 84.5444 0.6370 3.6274 0.1533 102.5667 810.0421 37.4802 75.0519 11.0452 11.6157 32.6076 11.6880 9.4279 36.7734 18.6621 19.0512 96.8185 157.5313 29.6005 28.2149 4.6039 7.8556 16.5249 12.9648 21.9191 3.0639 14.1183 72.9456 36.4899 1.9169 0.4745 3.4832 26.4771 12.0431 22.0958 700.2362 4.6304 0.6030 1.7789 1.1756 3.1842 10.5196 13.0953 17.7804 1102.5277 20.3615 44.5277 22.8670 39.5404 29.1345 17.6724 26.8547 24.3376 26.9590 53.6172 3.0892 8.8105 20.7145 13.6791 2.3026 0.8864 0.9560 0.0334 0.7385 0.1467 2.1934 0.0882 0.4747 0.7375 3.4736 6.6902 2.4611 0.5096 7.6484 5.4112 7.4302 15.8409 2.5127 0.6182 10.4589 8.9178 2.5650 2.1231 9.2477 13.1536 1.8152 14.0475 1.8411 15.0834 20.3961 26.0476 11.4191 4.1431 16.3350 1.9307 4.4420 8.7928
temp: 298.150 k
press: 1.00000 atm
elementType: 46 15 6 6 6 6 1 6 1 6 1 1 1 6 6 6 6 1 6 1 6 1 1 1 6 6 6 6 1 6 1 6 1 1 1 15 6 6 6 6 1 6 1 6 1 1 1 6 6 6 6 1 6 1 6 1 1 1 6 6 6 6 1 6 1 6 1 1 1 6 6 6 6 6 1 1 1 1 1 7 6 8 8 6 6 6 6 1 6 1 6 1 1 1 6 1 1 1 6 6 6 6 6 6 1 1 1 1 1 1 1 1 1
symmnumber: 1
zpe: 2452617.9 jmol-1
zpe.correction: 0.934153 hartree
zpe.thermalcorrener: 0.989236 hartree
zpe.thermalcorrenthalpy: 0.990180 hartree
zpe.thermalcorrgfe: 0.838835 hartree
zpe.sumelectzpe: -3137.312954 hartree
zpe.sumelectthermal: -3137.257870 hartree
zpe.sumelectthermalent: -3137.256926 hartree
zpe.sumelectthermalfe: -3137.408271 hartree
dipole: -5.8146 0.5024 0.1109
dipole: 5.8373
quadrupole: -321.9558 -322.8536 -322.6662
quadrupole: 9.7933 10.1446 -6.0134
quadrupole: 0.5361 -0.3617 -0.1744 9.7933 10.1446 -6.0134
hfenergy: -3138.2471064 hartree
pointgroup: C01 [X(C55H52N1O2P2Pd1)]
dipole: -2.2813474 0.1596945 0.2103375 debye
polarizability: 1056.1995066|-44.36038|934.5407734|1.753033|-29.5902762|932.7614393 unknown
InChI: InChI=1/55C.N.2O.2P.Pd.52H
charge 1 multiplicity 1
113 atoms
Pd -0.38939236 -0.22987379 -0.58347242
P  -2.4250902 -1.16233006 -0.07510552
C  -3.74985477 -0.04570773 0.49546521
C  -3.96853859 1.10930475 -0.26601013
C  -4.57357939 -0.31890113 1.59166969
C  -4.9771834 2.00170504 0.08438557
H  -3.34097705 1.31416522 -1.13543344
C  -5.58904424 0.57315841 1.93500074
H  -4.41996967 -1.21987759 2.18857006
C  -5.78549684 1.73692889 1.19199773
H  -5.12597461 2.90900426 -0.50548418
H  -6.2247514 0.35972195 2.79725076
H  -6.5736177 2.43876484 1.47396828
C  -2.23375702 -2.43769734 1.20735429
C  -1.89977893 -2.02483603 2.50663319
C  -2.24970289 -3.80390616 0.90181757
C  -1.60232372 -2.96674129 3.4862599
H  -1.86318941 -0.96223638 2.75343928
C  -1.94081912 -4.74320979 1.88630828
H  -2.5009216 -4.14243193 -0.10540842
C  -1.61878562 -4.32855596 3.17722737
H  -1.34865739 -2.63156472 4.49453012
H  -1.95292232 -5.80677938 1.63804923
H  -1.37782635 -5.06711134 3.9451675
C  -3.27130626 -1.98679673 -1.47131002
C  -4.46689081 -2.68623769 -1.25079218
C  -2.78180481 -1.85494623 -2.77220734
C  -5.14322977 -3.26354775 -2.32133794
H  -4.87317068 -2.77893279 -0.24029901
C  -3.46431286 -2.42740577 -3.84518023
H  -1.86266027 -1.29145505 -2.93946856
C  -4.64237481 -3.13625425 -3.61929857
H  -6.07047961 -3.81261121 -2.14277803
H  -3.07167454 -2.31660615 -4.85842155
H  -5.17804238 -3.58847562 -4.45715069
P  -0.39509603 1.75651817 0.77663581
C  1.3335508 2.30548607 1.06803351
C  1.71897021 3.64881965 1.00039532
C  2.30407943 1.33111581 1.34280974
C  3.05075704 4.00892297 1.20639087
H  0.98351172 4.42185553 0.77101729
C  3.62848353 1.69561031 1.56873323
H  2.0294088 0.27304347 1.37075102
C  4.00693736 3.03626989 1.49406885
H  3.33996817 5.06023262 1.13920294
H  4.36970904 0.92624986 1.79006124
H  5.05007669 3.31937398 1.65290353
C  -1.02396864 1.51257488 2.48584535
C  -0.19329258 0.96955266 3.47726462
C  -2.36314808 1.78212304 2.79777241
C  -0.69416972 0.69449066 4.74747755
H  0.85518127 0.75686266 3.26602703
C  -2.85882863 1.5096438 4.07207005
H  -3.03011402 2.2071882 2.04642224
C  -2.03020852 0.96053908 5.04873251
H  -0.03280996 0.26960893 5.50588969
H  -3.90612653 1.72467421 4.29473669
H  -2.42304496 0.74331623 6.04452863
C  -1.26601001 3.23951469 0.1769645
C  -1.58012786 4.32097135 1.01180264
C  -1.61269192 3.29499742 -1.17743613
C  -2.23785615 5.43392091 0.49320008
H  -1.31804285 4.29283989 2.07191671
C  -2.26385742 4.41170403 -1.69678859
H  -1.38154106 2.44371049 -1.8226421
C  -2.58030793 5.48085331 -0.85940766
H  -2.48491338 6.27076648 1.15024854
H  -2.53180046 4.44090545 -2.75516352
H  -3.0985031 6.35482041 -1.26072409
C  2.44372995 -2.43426479 -2.36233878
C  2.29654219 -2.26411243 0.07296786
C  0.94566631 -2.3903789 0.02065228
C  0.18790882 -2.16319091 -1.20095711
C  1.01702819 -1.87600287 -2.44530853
H  3.0547236 -1.94688371 -3.13350006
H  2.85554749 -2.33499995 1.00520488
H  0.42004942 -2.65193377 0.94102757
H  -0.66260487 -2.8339129 -1.35992958
H  0.54210281 -2.36043319 -3.30961573
N  3.04651851 -2.07114641 -1.07665896
C  4.35103433 -1.64583882 -1.07156605
O  4.74213124 -1.31701727 0.17726181
O  5.04985045 -1.56853227 -2.05114743
C  5.99830731 -0.77237067 0.37009424
C  6.83952874 -1.40480262 1.27873113
C  6.3665675 0.41473472 -0.25934331
C  8.07944366 -0.83389047 1.56514308
H  6.51276566 -2.33091209 1.75506091
C  7.61015617 0.97134628 0.0310313
H  5.683112 0.89779864 -0.95900877
C  8.46771918 0.35164497 0.94181566
H  8.74463242 -1.32242189 2.28068128
H  7.907359 1.90282402 -0.45608066
H  9.43943136 0.79616218 1.16744871
C  2.4891269 -3.94260866 -2.55851277
H  3.52657379 -4.30256251 -2.50803066
H  1.90095995 -4.46139047 -1.7868749
H  2.07872339 -4.20889944 -3.54286876
C  1.73836046 1.97820877 -2.17818584
C  1.54835942 0.52296487 -1.82393976
C  0.96565478 -0.37674112 -2.68083862
C  0.39648975 0.05706835 -4.00213002
C  0.30229579 1.56201205 -4.1881316
C  1.55798126 2.24460909 -3.667266
H  2.14728558 0.14752634 -0.99120511
H  1.04789715 2.61577106 -1.60586886
H  1.06348078 -0.38168697 -4.76978794
H  -0.57859535 -0.42452074 -4.17642918
H  0.13782012 1.79374484 -5.25111983
H  -0.57966467 1.94638612 -3.64937778
H  2.43268305 1.8591436 -4.21997533
H  1.52012565 3.32901 -3.85149088
H  2.74349196 2.28194135 -1.84500497
