program: Gaussian 16
title: Title
version: ES64L-G16RevC.01
method: RPBE1PBE
basis: def2SVP
operation: Freq
keyword: #N
keyword: Geom=AllCheck
keyword: Guess=TCheck
keyword: SCRF=Check
keyword: GenChk
keyword: RPBE1PBE/def2SVP
keyword: Freq
converged: YES YES NO YES
title: Mulliken charges:
elementType: Pd P C C C C H C H C H H H C C C C H C H C H H H C C C C H C H C H H H C C C C C H H H H H N C O O C C C C H C H C H H H C H H H C C C C C C H H H H H H H H H C C C C B B O O O O C H H H C H H H C H H H C H H H C H H H C H H H C H H H C H H H
charge: -0.221675 0.385721 -0.178560 0.002074 -0.038909 -0.011602 0.040210 -0.016219 0.050898 -0.003328 0.038672 0.042295 0.042734 -0.148019 -0.047726 -0.012278 -0.010464 0.051152 -0.019985 0.057371 -0.013364 0.044528 0.047182 0.049683 -0.165128 -0.007528 -0.009934 -0.028756 0.059163 -0.030226 0.052537 -0.022330 0.038563 0.039786 0.042766 -0.062172 0.047770 0.005804 -0.069506 0.052678 0.080665 0.121569 0.133369 0.143643 0.072896 -0.304856 0.448755 -0.321054 -0.286411 0.195754 -0.041624 -0.030615 -0.041512 0.043764 -0.041701 0.038264 -0.015928 0.042977 0.041911 0.039641 0.007545 0.066188 0.068145 0.060537 0.017938 -0.140185 -0.117668 -0.083713 -0.027754 -0.070925 0.031881 0.055691 0.107083 0.068110 0.044070 0.043725 0.032910 0.041857 0.052838 -0.137162 -0.152399 -0.158829 -0.155441 0.118808 0.313633 -0.268811 -0.254424 -0.271847 -0.276811 0.031896 0.053042 0.051292 0.066434 0.035406 0.060162 0.055829 0.046996 0.012402 0.056417 0.066750 0.060240 0.044110 0.047590 0.057355 0.051813 0.021974 0.054506 0.053713 0.054753 0.041548 0.047161 0.056812 0.054054 0.026799 0.055439 0.056533 0.073452 0.032922 0.055172 0.051358 0.057695
chargesum: 1.00000
title: Mulliken charges with hydrogens summed into heavy atoms:
elementType: Pd P C C C C C C C C C C C C C C C C C C C C C C C N C O O C C C C C C C C C C C C C C C C C B B O O O O C C C C C C C C
charge: -0.221675 0.385721 -0.178560 0.042285 0.011989 0.027070 0.026076 0.039406 -0.148019 0.003427 0.045093 0.034064 0.027197 0.036319 -0.165128 0.051636 0.042603 0.009806 0.009560 0.020436 0.018493 0.169339 0.139173 0.074137 0.125573 -0.304856 0.448755 -0.321054 -0.286411 0.195754 0.002140 0.007649 0.001465 0.000210 0.023713 0.202415 0.126467 -0.108303 -0.117668 0.091480 0.060041 0.003842 -0.137162 -0.152399 -0.158829 -0.155441 0.118808 0.313633 -0.268811 -0.254424 -0.271847 -0.276811 0.202665 0.198393 0.195809 0.200868 0.184946 0.199576 0.212223 0.197146
chargesum: 0.99999
1716.lowfreq: -43.3167 -1.5529 -0.0011 -0.0003 0.0005 4.0507 7.0466 16.5951 21.2528
redmass: 4.6745 4.9941 5.3903 4.5831 4.4598 3.8222 3.5384 4.9836 4.2178 4.2504 5.2022 6.0413 5.1460 4.3084 4.6732 5.6612 4.9259 4.7724 5.0302 4.9923 4.9745 4.6003 4.0577 4.2602 4.1741 4.2452 4.1668 4.9605 3.8222 5.5844 5.4137 4.9423 6.3146 3.8644 5.4256 4.6396 3.6293 4.0169 4.4679 4.7656 3.3702 4.6606 1.2248 1.2486 4.2958 1.1892 1.5905 1.1938 4.5546 1.9281 2.9469 4.6642 4.7885 2.0969 2.1576 1.9836 3.8123 1.6638 2.0370 1.4119 1.8804 1.5907 1.1701 1.1093 2.2935 4.7753 2.5406 2.7565 2.2770 2.2436 3.5750 4.2406 2.4976 2.8425 2.8876 2.8663 2.8763 2.9334 5.6808 4.3139 6.1389 5.9663 2.5229 4.2183 2.6204 3.9027 4.5460 2.5937 4.4172 2.9789 3.3423 3.3797 4.7225 3.7194 7.0055 3.5447 3.8253 3.8732 3.9460 6.1261 6.6413 6.6915 6.3467 6.3143 6.0161 4.6402 3.2584 4.2418 3.2547 5.9913 2.1726 2.5012 2.4716 2.8879 2.1681 3.2443 1.8427 8.6251 1.8765 4.7856 2.2654 1.9663 2.4739 1.7892 1.3609 2.0954 3.7584 3.8492 3.7424 1.4368 2.1023 2.7010 3.3923 1.2573 1.2732 1.2694 2.5328 2.6251 2.3046 1.7533 1.8154 1.4001 1.4397 1.4312 1.4351 1.4356 1.4222 1.4550 1.8792 1.4234 1.4179 1.3542 1.6771 1.6951 1.7462 1.7437 2.4801 1.3682 1.3083 1.3191 1.3580 1.3815 1.6162 1.6536 1.6879 1.9137 2.7705 2.8576 3.0992 3.3816 2.0906 1.3176 1.3384 1.3340 1.3487 2.0873 2.0678 2.4619 2.6082 2.6154 1.6373 1.9078 1.9860 1.4096 1.4038 1.4777 1.5046 1.8856 1.6614 2.8011 2.3993 2.4651 2.6265 2.1581 2.4524 3.0925 1.8139 1.2743 1.0701 1.0642 1.2772 1.3048 1.6842 1.1370 1.1367 1.1155 3.7908 2.7499 2.7234 1.1324 1.6873 1.3072 1.3172 2.8831 2.9385 1.2703 2.0684 2.3997 1.8564 4.4453 2.4591 1.2321 3.0668 2.8238 2.5873 1.9887 1.8898 1.9077 1.4233 1.2952 1.3986 2.6391 1.3960 5.2219 1.4265 1.5564 2.2884 1.6888 1.3615 2.1286 1.3974 2.8302 1.9878 1.3716 1.4379 1.5981 1.6367 6.0181 5.4419 1.3193 1.3006 7.6667 1.7890 2.2585 1.0887 1.0541 1.0579 1.0606 1.0598 1.0664 1.0576 1.0764 1.0631 1.1119 1.0732 1.0840 1.0852 1.0480 1.0518 1.0682 1.0748 1.0880 1.1101 2.1728 1.1393 2.3082 2.3683 1.0715 1.0747 2.6446 2.3186 2.2247 3.4565 2.1644 2.9360 4.5789 6.1621 6.2237 6.1971 6.1383 6.3159 6.7888 6.2523 6.7729 7.7246 12.6218 1.0717 1.0669 1.0832 1.0650 1.0369 1.0367 1.0374 1.0372 1.0373 1.0377 1.0383 1.0375 1.0435 1.0703 1.0861 1.0927 1.1024 1.1045 1.0908 1.1046 1.1047 1.1047 1.0916 1.1014 1.1043 1.1044 1.1040 1.1045 1.1050 1.1047 1.1040 1.1045 1.1035 1.1040 1.1044 1.1043 1.1033 1.1019 1.0867 1.0869 1.0868 1.0870 1.0909 1.0906 1.0918 1.0903 1.0914 1.0946 1.0953 1.0945 1.0959 1.0978 1.1001 1.0989 1.0998 1.0968 1.0944 1.0947 1.0915 1.0927 1.0944
temp: 298.150 k
press: 1.00000 atm
elementType: 46 15 6 6 6 6 1 6 1 6 1 1 1 6 6 6 6 1 6 1 6 1 1 1 6 6 6 6 1 6 1 6 1 1 1 6 6 6 6 6 1 1 1 1 1 7 6 8 8 6 6 6 6 1 6 1 6 1 1 1 6 1 1 1 6 6 6 6 6 6 1 1 1 1 1 1 1 1 1 6 6 6 6 5 5 8 8 8 8 6 1 1 1 6 1 1 1 6 1 1 1 6 1 1 1 6 1 1 1 6 1 1 1 6 1 1 1 6 1 1 1
symmnumber: 1
zpe: 2681137.7 jmol-1
zpe.correction: 1.021191 hartree
zpe.thermalcorrener: 1.079616 hartree
zpe.thermalcorrenthalpy: 1.080560 hartree
zpe.thermalcorrgfe: 0.928348 hartree
zpe.sumelectzpe: -2923.426179 hartree
zpe.sumelectthermal: -2923.367755 hartree
zpe.sumelectthermalent: -2923.366810 hartree
zpe.sumelectthermalfe: -2923.519022 hartree
dipole: -1.7015 -2.1710 -1.9928
dipole: 3.4029
quadrupole: -320.7068 -316.3173 -320.2595
quadrupole: -15.0998 2.2576 9.6292
quadrupole: -1.6123 2.7772 -1.1650 -15.0998 2.2576 9.6292
hfenergy: -2924.4473704 hartree
pointgroup: C01 [X(C49H61B2N1O6P1Pd1)]
dipole: -0.6619901 -0.8350883 -0.8104264 debye
polarizability: 890.3275103|0.2182187|917.1434157|25.7323292|-19.5260516|808.2686293 unknown
InChI: InChI=1/49C.2B.N.6O.P.Pd.61H
charge 1 multiplicity 1
121 atoms
Pd -0.43041158 0.15243452 -0.77831116
P  0.67024729 -1.24508365 0.84116206
C  2.00040548 -0.30427277 1.67191208
C  3.1839483 -0.8995436 2.12223854
C  1.77318171 1.05258026 1.93152037
C  4.11996037 -0.14624826 2.82804462
H  3.3836293 -1.9530682 1.92052962
C  2.71531328 1.80652299 2.62767286
H  0.84423832 1.51835666 1.60133266
C  3.89056258 1.205576 3.07851816
H  5.04567271 -0.61708559 3.16531469
H  2.52740765 2.86581454 2.81750891
H  4.63435007 1.79503502 3.61932176
C  1.49341951 -2.75769257 0.22761646
C  1.87593576 -2.8464477 -1.11414295
C  1.80318097 -3.81516448 1.0954535
C  2.57439888 -3.95738809 -1.58284413
H  1.60748361 -2.05114664 -1.80782966
C  2.49907135 -4.92706213 0.62622952
H  1.49849073 -3.77083466 2.14325201
C  2.89047294 -4.99839743 -0.71133511
H  2.86200104 -4.01159456 -2.63500712
H  2.73670558 -5.74376649 1.31155025
H  3.43508783 -5.87214367 -1.07636854
C  -0.29668585 -1.88049 2.26605036
C  -1.25428835 -2.87975809 2.04596669
C  -0.06293176 -1.42804491 3.56897666
C  -1.94656451 -3.43338321 3.11922197
H  -1.46478792 -3.21634192 1.02969511
C  -0.76653631 -1.98065653 4.64000499
H  0.67892268 -0.65036914 3.7582283
C  -1.70234192 -2.98967239 4.4199044
H  -2.68630615 -4.21653166 2.93669335
H  -0.57261336 -1.62206673 5.6535669
H  -2.24650169 -3.42621261 5.26066579
C  1.14014721 3.06251003 -2.36924255
C  1.22383893 0.62398104 -2.19041469
C  -0.05545331 0.58753608 -2.81052128
C  -0.93286635 1.60555675 -2.41790599
C  -0.39630339 3.00711787 -2.19962314
H  1.53462483 3.88199003 -1.75659344
H  1.92453161 -0.20187319 -2.29257887
H  -0.37479439 -0.28568754 -3.37933294
H  -1.98614197 1.52127033 -2.69638558
H  -0.80321042 3.53519466 -3.07968572
N  1.78483578 1.84285585 -1.86515437
C  3.02596082 1.95284419 -1.26633748
O  3.52790624 0.73711212 -1.03713076
O  3.54516836 3.01164903 -1.01459243
C  4.76343912 0.45647465 -0.48760702
C  5.60812036 1.39095365 0.10742501
C  5.10322527 -0.89555679 -0.53925154
C  6.80801308 0.94207739 0.66193118
H  5.3296593 2.44027459 0.14734522
C  6.30171247 -1.32398272 0.02035729
H  4.40985488 -1.59972622 -1.00229748
C  7.16020024 -0.40528708 0.6266332
H  7.4729367 1.66839663 1.13527241
H  6.56150628 -2.38442234 -0.01468058
H  8.1008856 -0.7397387 1.06928178
C  1.55147454 3.29729529 -3.81705175
H  1.17385444 2.50281068 -4.47870939
H  1.1482746 4.25793175 -4.16759235
H  2.64678934 3.33402123 -3.90320549
C  -2.12169421 5.81118119 -0.12628591
C  -1.69955996 4.85118977 -1.19445572
C  -0.86391192 3.81675109 -1.00998379
C  -0.26105128 3.54233696 0.34097228
C  -0.27651957 4.77116 1.24318886
C  -1.65291582 5.42033174 1.2728697
H  -2.07955893 5.04722119 -2.20418573
H  -1.72752276 6.80851444 -0.39775784
H  -0.80181749 2.70573562 0.82224427
H  0.77435313 3.18893214 0.22050784
H  0.04285557 4.49350439 2.26016487
H  0.46533419 5.49624627 0.86566912
H  -2.37256166 4.71533615 1.71730945
H  -1.6506348 6.30396394 1.92924318
H  -3.21920434 5.92745447 -0.14649727
C  -3.26220139 -2.13746159 -2.95913651
C  -2.48778743 -3.18128094 -2.08151506
C  -4.37997923 1.34606064 1.07934157
C  -3.34368121 0.87721246 2.1601401
B  -2.75820901 0.06358308 0.11887102
B  -2.33444633 -1.09743957 -1.15731082
O  -2.24811627 0.37468874 1.34310093
O  -4.02609506 0.52612373 -0.06476939
O  -2.24175844 -2.43328429 -0.86706402
O  -2.7804014 -0.87911431 -2.43820042
C  -3.83087919 -0.30635857 2.98090096
H  -4.63090048 -0.00712632 3.67216433
H  -4.20371645 -1.11583978 2.33722876
H  -2.99170752 -0.70260181 3.5672306
C  -2.81436517 1.96536766 3.06902738
H  -3.63122578 2.4055189 3.65907183
H  -2.08136761 1.53504808 3.7664344
H  -2.320347 2.76587061 2.50635202
C  -4.19696444 2.78962454 0.64275559
H  -4.8420961 2.98468308 -0.22579366
H  -4.47708715 3.48991103 1.44204371
H  -3.16100889 2.98933833 0.33918578
C  -5.82882972 1.0788877 1.43531702
H  -6.0185164 0.01021093 1.59509824
H  -6.10833949 1.62651775 2.34723091
H  -6.47761163 1.42522506 0.618173
C  -4.76639932 -2.15594967 -2.72009192
H  -5.22976514 -3.06149459 -3.13556397
H  -5.00109556 -2.09897017 -1.64736906
H  -5.21462638 -1.28122312 -3.21258762
C  -3.2779178 -4.42554992 -1.72659068
H  -4.18400881 -4.18096801 -1.15819003
H  -3.56830814 -4.97067174 -2.6366357
H  -2.65702843 -5.0944389 -1.11316982
C  -1.13241424 -3.56283834 -2.6545402
H  -1.23892328 -4.18489202 -3.55381476
H  -0.54031235 -2.67412302 -2.91143777
H  -0.5704477 -4.13330361 -1.90251069
C  -2.95997553 -2.20645545 -4.44252445
H  -3.53311357 -1.43202882 -4.97227313
H  -1.89432077 -2.0473187 -4.65180678
H  -3.25251909 -3.18505197 -4.85047219
