program: Gaussian 16
title: Title
version: ES64L-G16RevC.01
method: RPBE1PBE
basis: def2SVP
operation: Freq
keyword: #N
keyword: Geom=AllCheck
keyword: Guess=TCheck
keyword: SCRF=Check
keyword: GenChk
keyword: RPBE1PBE/def2SVP
keyword: Freq
converged: YES YES YES YES
title: Mulliken charges:
elementType: Pd P C C C C H C H C H H H C C C C H C H C H H H C C C C H C H C H H H C C C C C H H H H H N C O O C C C C H C H C H H H C H H H C C C C C C H H H H H H H H H C C C C B B O O O O C H H H C H H H C H H H C H H H C H H H C H H H C H H H C H H H
charge: -0.222475 0.369473 -0.189040 -0.013248 0.010159 -0.029433 0.053392 -0.024220 0.058683 -0.019242 0.040419 0.036037 0.043143 -0.182003 0.000938 -0.038618 -0.022116 0.051113 0.000599 0.047606 -0.010400 0.040933 0.041347 0.042751 -0.154066 -0.024947 -0.048448 -0.024350 0.047442 -0.018098 0.055740 -0.017852 0.043710 0.042991 0.046690 -0.053855 0.054373 -0.002345 -0.037501 0.022367 0.093227 0.120021 0.116255 0.142380 0.075131 -0.292150 0.454808 -0.317680 -0.273241 0.173167 -0.024197 -0.022282 -0.043102 0.043620 -0.044547 0.041808 -0.014118 0.046304 0.046968 0.043117 0.011286 0.067822 0.069501 0.062704 0.002601 -0.130750 -0.105188 -0.048048 -0.058095 -0.051637 0.030783 0.049289 0.086990 0.081280 0.047980 0.049417 0.042938 0.047905 0.057274 -0.142132 -0.151510 -0.148273 -0.158713 0.206970 0.183180 -0.248316 -0.266002 -0.272598 -0.278069 0.039234 0.051125 0.055275 0.047824 0.018517 0.059175 0.070816 0.054898 0.041314 0.040447 0.056524 0.057988 0.021890 0.057750 0.056910 0.056961 0.020549 0.055187 0.056078 0.056440 0.043013 0.046977 0.055444 0.050834 0.028415 0.073062 0.055022 0.050441 0.029166 0.055576 0.059151 0.056275
chargesum: 1.00000
title: Mulliken charges with hydrogens summed into heavy atoms:
elementType: Pd P C C C C C C C C C C C C C C C C C C C C C C C N C O O C C C C C C C C C C C C C C C C C B B O O O O C C C C C C C C
charge: -0.222475 0.369473 -0.189040 0.040144 0.068842 0.010985 0.011816 0.023901 -0.182003 0.052051 0.008988 0.018817 0.041946 0.032352 -0.154066 0.022495 0.007292 0.019359 0.024893 0.028839 0.039372 0.174394 0.113911 0.104879 0.097498 -0.292150 0.454808 -0.317680 -0.273241 0.173167 0.019423 0.019525 0.003202 0.002421 0.028998 0.211314 0.109164 -0.099967 -0.105188 0.120222 0.039301 0.039206 -0.142132 -0.151510 -0.148273 -0.158713 0.206970 0.183180 -0.248316 -0.266002 -0.272598 -0.278069 0.193457 0.203405 0.196273 0.193511 0.188254 0.196267 0.206939 0.200168
chargesum: 0.99999
1716.lowfreq: -68.2342 -9.8570 -2.5145 -0.0013 -0.0010 -0.0009 3.7716 10.4120 20.9080
redmass: 4.0829 4.9003 5.2077 4.1582 4.0771 4.1304 5.6854 4.1473 4.5093 4.9384 4.4468 5.2811 5.1273 4.6504 4.7107 5.1580 4.3529 5.0670 5.4684 5.2260 4.9375 4.8544 5.0433 5.3825 4.7787 5.8884 4.9220 3.9488 4.2994 3.7267 3.9125 4.8281 5.2665 8.1293 3.6661 5.1251 3.6033 2.9906 4.5538 2.4053 4.4127 1.2388 4.0372 1.1991 1.2646 1.2347 1.2676 3.5965 2.9269 4.7082 3.3877 4.7923 2.2227 4.1755 2.0661 2.0479 1.7235 1.2130 3.3076 1.1343 1.2785 2.9637 1.1035 2.9502 2.5437 3.1184 2.4035 2.2879 2.4861 2.6031 4.4488 2.3759 5.5912 2.8984 2.8964 2.9460 2.8331 2.9330 5.6462 3.9801 6.7566 6.1018 3.1103 2.8227 3.3747 4.3149 4.7278 2.7623 4.3269 3.2426 3.2993 3.3272 3.3671 4.6432 3.2872 4.5168 4.0467 3.9003 3.8620 6.0748 6.2029 6.3251 4.5473 5.6450 6.3150 8.9729 3.7201 3.2545 3.2298 6.0751 3.0230 1.8750 1.6308 5.3316 2.5391 2.9874 2.1854 8.3398 1.9607 2.3709 1.9518 1.8032 3.5386 2.3191 1.6564 1.3403 8.4138 1.3059 3.0873 4.5926 2.3712 1.9288 3.6401 1.2690 2.6960 2.1453 1.3998 1.2923 2.3578 1.9687 1.8419 1.3688 1.5072 1.4340 1.4320 1.4084 1.4765 1.4560 1.3711 2.0509 1.3938 1.6573 1.5632 1.4286 1.7332 1.4056 1.6753 2.6159 1.3352 1.3219 1.3647 1.4595 1.3669 1.4360 4.1609 5.3414 3.7703 2.2666 4.5499 1.3836 1.4284 1.3278 1.3432 1.5829 1.3318 1.6240 2.0065 2.5180 2.4871 2.5879 1.7291 1.6906 1.8139 1.3733 1.6109 1.5222 1.5203 1.7521 1.5193 2.8951 2.5120 2.5252 2.9039 2.6691 2.2196 1.7163 1.2836 3.2050 1.3006 1.0891 1.0642 1.0642 1.0659 2.3499 1.1471 2.6749 1.1276 2.7300 3.8645 1.5288 1.1411 1.1426 1.5770 2.9540 2.8538 1.4171 1.4098 3.2716 2.4547 2.4729 2.1330 1.3826 3.0757 2.7943 1.3219 4.8589 1.3474 1.3779 1.2938 1.3712 1.4131 2.4367 4.7265 2.6555 2.2506 1.6154 4.6197 1.6958 1.6245 1.3557 1.3498 1.5371 1.4911 1.4025 2.9927 1.7505 1.4656 4.9294 6.6416 1.3784 1.3495 8.3369 2.0676 1.8960 1.1717 1.0527 1.0776 1.0788 1.0509 1.0558 1.0617 1.0595 1.0686 1.0622 1.1167 1.0851 1.0547 1.0542 1.0534 1.1181 1.0750 1.0728 1.1099 2.0597 1.1699 2.3962 2.3815 1.0768 1.0742 2.5937 2.3066 2.2101 2.2340 3.0140 2.9705 6.1008 6.0626 6.1869 6.3498 6.1400 6.1695 6.2627 6.8536 6.8946 7.9328 12.7915 1.0770 1.0687 1.0662 1.0838 1.0369 1.0368 1.0368 1.0369 1.0865 1.0378 1.0383 1.0380 1.0639 1.0400 1.0378 1.0967 1.1012 1.1047 1.0999 1.1040 1.1047 1.1046 1.1051 1.1045 1.1043 1.1042 1.0921 1.1044 1.1046 1.1045 1.1048 1.0932 1.1038 1.1037 1.1041 1.1040 1.1024 1.0902 1.0867 1.0869 1.0890 1.0869 1.1001 1.0906 1.0902 1.0935 1.0914 1.0947 1.0942 1.0958 1.0975 1.0969 1.0918 1.0986 1.0983 1.0986 1.1006 1.0954 1.0919 1.0958 1.0957
temp: 298.150 k
press: 1.00000 atm
elementType: 46 15 6 6 6 6 1 6 1 6 1 1 1 6 6 6 6 1 6 1 6 1 1 1 6 6 6 6 1 6 1 6 1 1 1 6 6 6 6 6 1 1 1 1 1 7 6 8 8 6 6 6 6 1 6 1 6 1 1 1 6 1 1 1 6 6 6 6 6 6 1 1 1 1 1 1 1 1 1 6 6 6 6 5 5 8 8 8 8 6 1 1 1 6 1 1 1 6 1 1 1 6 1 1 1 6 1 1 1 6 1 1 1 6 1 1 1 6 1 1 1
symmnumber: 1
zpe: 2679157.1 jmol-1
zpe.correction: 1.020437 hartree
zpe.thermalcorrener: 1.079057 hartree
zpe.thermalcorrenthalpy: 1.080001 hartree
zpe.thermalcorrgfe: 0.926482 hartree
zpe.sumelectzpe: -2923.427784 hartree
zpe.sumelectthermal: -2923.369165 hartree
zpe.sumelectthermalent: -2923.368220 hartree
zpe.sumelectthermalfe: -2923.521740 hartree
dipole: 0.3113 2.4355 -2.9019
dipole: 3.8013
quadrupole: -303.1883 -314.7973 -325.7424
quadrupole: 7.3159 6.7458 11.6993
quadrupole: 11.3877 -0.2213 -11.1664 7.3159 6.7458 11.6993
hfenergy: -2924.4482213 hartree
pointgroup: C01 [X(C49H61B2N1O6P1Pd1)]
dipole: 0.117841 0.9843648 -1.1197138 debye
polarizability: 935.5163737|11.529124|884.0129149|2.3628528|16.1050733|803.2214568 unknown
InChI: InChI=1/49C.2B.N.6O.P.Pd.61H
charge 1 multiplicity 1
121 atoms
Pd -0.53520596 0.17631263 -0.61939261
P  -0.11594233 -1.52778403 1.00798904
C  -1.0713966 -1.41099979 2.5651127
C  -0.43117704 -1.28980894 3.80596265
C  -2.47164582 -1.41939128 2.51177541
C  -1.18285606 -1.17255417 4.97370923
H  0.65824887 -1.28381947 3.86576127
C  -3.21635782 -1.31895671 3.68433226
H  -2.98253252 -1.49614516 1.5504433
C  -2.57648628 -1.18809131 4.91614963
H  -0.67304937 -1.07235056 5.93471088
H  -4.30728594 -1.32498742 3.62958449
H  -3.1637675 -1.09666652 5.83296129
C  1.61807017 -1.52760437 1.58741717
C  2.35293295 -2.70274982 1.77299219
C  2.20952055 -0.29600036 1.89203405
C  3.67041274 -2.63897652 2.22503011
H  1.90295776 -3.67315152 1.55642285
C  3.52307178 -0.23477914 2.34819069
H  1.631628 0.62166737 1.78452428
C  4.26147843 -1.40782154 2.50403547
H  4.24052473 -3.56181869 2.35471558
H  3.97474195 0.73336865 2.5744379
H  5.30022935 -1.3595261 2.83782925
C  -0.38301491 -3.23005033 0.40002961
C  -1.3573379 -4.0781499 0.93517166
C  0.41239966 -3.67987115 -0.66492469
C  -1.54916096 -5.35145475 0.39729115
H  -1.97358651 -3.75128009 1.77374311
C  0.2208716 -4.95359187 -1.19286267
H  1.21233772 -3.04572629 -1.05599956
C  -0.76692228 -5.78985059 -0.66948406
H  -2.31677088 -6.00352651 0.82021392
H  0.84958131 -5.29527284 -2.01824671
H  -0.92114597 -6.78625165 -1.08980783
C  2.10674707 1.63273486 -2.67836929
C  0.79465675 -0.39179011 -2.27040312
C  -0.34655814 0.32655546 -2.73312066
C  -0.39669084 1.66337995 -2.34344139
C  0.87281744 2.48349278 -2.28611954
H  2.99084246 2.08105616 -2.21353982
H  0.85078711 -1.47809181 -2.35002465
H  -1.20063305 -0.19191441 -3.16478522
H  -1.33679445 2.21144296 -2.43836133
H  0.73310431 3.19507378 -3.11876118
N  1.99991359 0.26557388 -2.14435523
C  3.05424334 -0.44714898 -1.60701003
O  4.13359432 0.33355481 -1.48433573
O  2.97719237 -1.60713792 -1.29166629
C  5.26212862 -0.08922227 -0.80176186
C  5.82641866 0.84635084 0.06085444
C  5.83256579 -1.344595 -0.99113596
C  6.98067809 0.51226978 0.76431973
H  5.3498362 1.82181555 0.17563174
C  6.98376117 -1.66709119 -0.27269153
H  5.38121687 -2.05964786 -1.67701664
C  7.5581167 -0.74789615 0.60497054
H  7.42615368 1.24081942 1.44530006
H  7.43655981 -2.65202804 -0.40738521
H  8.4596054 -1.01222195 1.16185258
C  2.32065316 1.57890982 -4.1850425
H  1.4489259 1.15374367 -4.70498214
H  2.49133666 2.59340492 -4.57181008
H  3.20210347 0.96741873 -4.42477217
C  1.6382387 5.56559676 -0.04947638
C  1.17095632 4.67177776 -1.15720172
C  1.14453937 3.33341675 -1.06688077
C  1.52770898 2.61315528 0.19201903
C  1.82866157 3.51968453 1.38292715
C  2.50938444 4.80868812 0.94635847
H  0.87892265 5.14346861 -2.10235777
H  2.19278805 6.41501932 -0.48054751
H  0.70402596 1.91322466 0.4465017
H  2.39512252 1.96320689 -0.01545448
H  0.89493652 3.77183542 1.91027368
H  2.44955322 2.9787429 2.11382348
H  2.73367488 5.43897202 1.82045055
H  3.47612885 4.56809895 0.46984971
H  0.76941002 6.01692513 0.46560743
C  -4.26844575 -0.77153269 -2.69434724
C  -3.87912504 -1.95645105 -1.74361688
C  -2.8752391 3.45391169 0.91557333
C  -2.96075814 2.4794641 2.13582732
B  -2.79509482 1.30519939 0.20199693
B  -3.06915285 0.01719185 -0.92695917
O  -3.24246157 1.22009193 1.48353435
O  -2.40028646 2.57170831 -0.13652959
O  -3.41935732 -1.25533337 -0.56290569
O  -3.40502895 0.29339559 -2.22917654
C  -4.07246405 2.7817052 3.1195997
H  -4.05508474 2.03961965 3.93073598
H  -3.93395075 3.77796457 3.56459535
H  -5.05905331 2.74361167 2.64067231
C  -1.63549401 2.30679959 2.86592448
H  -1.37495359 3.20427346 3.44408633
H  -1.71665529 1.45499682 3.55562966
H  -0.81747536 2.08937565 2.16411044
C  -1.90991847 4.60551977 1.07810229
H  -0.88606623 4.25101516 1.23402823
H  -1.91596923 5.23013559 0.17340944
H  -2.20206 5.23396254 1.93205689
C  -4.23906679 3.95981435 0.46356672
H  -4.64695161 4.69339965 1.1727515
H  -4.13063648 4.44957994 -0.51460068
H  -4.95971023 3.13570911 0.35739956
C  -5.69791604 -0.28710051 -2.49007975
H  -5.83393879 0.65956996 -3.03218577
H  -6.42777389 -1.01322939 -2.8740808
H  -5.90984833 -0.1056507 -1.42618743
C  -5.02940589 -2.86021491 -1.34486993
H  -5.81938562 -2.30669693 -0.82199618
H  -5.46449663 -3.34554578 -2.23067852
H  -4.65863637 -3.64807766 -0.67322824
C  -2.71956093 -2.79074574 -2.26536552
H  -2.40090534 -3.49272083 -1.48511585
H  -3.01393147 -3.36901289 -3.15176684
H  -1.85301781 -2.16777161 -2.52402517
C  -4.00118268 -1.01884302 -4.16538384
H  -2.94557186 -1.24525653 -4.36310595
H  -4.60766392 -1.86080811 -4.52976716
H  -4.27553977 -0.12599189 -4.74527516
