program: Gaussian 16
title: Title
version: ES64L-G16RevC.01
method: RPBE1PBE
basis: def2SVP
operation: Freq
keyword: #N
keyword: Geom=AllCheck
keyword: Guess=TCheck
keyword: SCRF=Check
keyword: GenChk
keyword: RPBE1PBE/def2SVP
keyword: Freq
converged: YES YES NO YES
title: Mulliken charges:
elementType: Pd P C C C C H C H C H H H C C C C H C H C H H H C C C C H C H C H H H C C C C C H H H H H N C O O C C C C H C H C H H H C H H H C C C C C C H H H H H H H H H C C C C B B O O O O C H H H C H H H C H H H C H H H C H H H C H H H C H H H C H H H
charge: -0.340786 0.388860 -0.170851 -0.013816 0.008172 -0.030222 0.054150 -0.032360 0.068210 -0.018892 0.040696 0.037417 0.043300 -0.195803 -0.004748 -0.026512 -0.021395 0.049171 0.001761 0.069455 -0.014404 0.043307 0.041085 0.043696 -0.131767 -0.016494 -0.077065 -0.024095 0.035282 -0.018156 0.068923 -0.021193 0.042988 0.042066 0.045597 -0.065673 0.064615 -0.018201 -0.049659 0.024292 0.091445 0.106072 0.127830 0.140646 0.068001 -0.305769 0.452849 -0.324241 -0.278227 0.168302 -0.026507 -0.020414 -0.039936 0.044196 -0.045846 0.039653 -0.014966 0.045786 0.047029 0.043205 0.018926 0.065982 0.067053 0.060677 0.007841 -0.137268 -0.096192 -0.004693 -0.054966 -0.060356 0.028374 0.045433 0.062912 0.073167 0.040190 0.042724 0.038848 0.041491 0.055524 -0.150389 -0.145369 -0.151043 -0.147341 0.255679 0.222788 -0.256641 -0.254678 -0.266660 -0.259765 0.034791 0.053370 0.056691 0.051683 0.016827 0.056429 0.068797 0.063398 0.030915 0.068672 0.059009 0.058587 0.021478 0.056867 0.059780 0.042813 0.011920 0.072943 0.059271 0.060490 0.037032 0.052281 0.061067 0.056774 0.009533 0.072805 0.058101 0.056758 0.044868 0.048616 0.059490 0.055638
chargesum: 1.00000
title: Mulliken charges with hydrogens summed into heavy atoms:
elementType: Pd P C C C C C C C C C C C C C C C C C C C C C C C N C O O C C C C C C C C C C C C C C C C C B B O O O O C C C C C C C C
charge: -0.340786 0.388860 -0.170851 0.040334 0.076382 0.010474 0.005057 0.024408 -0.195803 0.044423 0.042942 0.021912 0.042847 0.029292 -0.131767 0.018788 -0.008142 0.018893 0.023911 0.024404 0.025772 0.170687 0.109629 0.090987 0.092293 -0.305769 0.452849 -0.324241 -0.278227 0.168302 0.017689 0.019239 0.005850 0.001183 0.028239 0.212638 0.108798 -0.108893 -0.096192 0.131386 0.027948 0.019983 -0.150389 -0.145369 -0.151043 -0.147341 0.255679 0.222788 -0.256641 -0.254678 -0.266660 -0.259765 0.196535 0.205451 0.217183 0.180938 0.204625 0.207154 0.197196 0.208612
chargesum: 0.99999
1716.lowfreq: -10.2315 -0.0017 -0.0009 0.0003 3.1788 6.1674 8.6320 20.4241 26.9823
redmass: 4.5003 5.2733 4.0188 4.9874 3.9388 4.2570 4.3904 4.5018 4.8717 4.7160 4.1460 4.9056 4.7492 4.5110 5.2204 4.6467 4.9188 4.7948 4.9336 4.6078 4.9626 5.0503 3.3807 4.3960 5.2274 3.8373 5.6845 5.2976 4.5406 3.8649 4.6009 5.4695 4.5105 4.3961 5.0814 5.7491 6.8023 5.3177 4.8382 4.8297 2.2939 1.7039 1.2063 2.3301 1.3111 1.7615 1.3107 4.3429 1.6283 4.6590 3.7700 4.9195 2.2882 2.3873 2.7483 1.4863 2.1514 1.4279 1.4852 1.4897 3.6123 1.1239 1.1972 3.0043 3.1506 2.4065 2.1685 2.1832 2.0819 3.2705 2.5249 5.2495 3.9477 2.8651 2.9456 2.9494 3.3920 4.2576 2.9559 4.4108 6.9921 2.4624 4.7309 4.9234 2.8559 4.1798 4.2714 2.9226 4.4378 3.3265 3.3165 3.3442 3.3551 4.5042 3.1332 5.6760 3.9279 4.2872 3.8814 6.3465 6.1509 6.3362 6.3545 6.3642 6.2664 4.2232 3.6606 3.2492 3.2526 6.1956 2.9799 1.8296 3.6455 2.0925 1.9074 4.0976 2.0287 8.6305 1.7751 2.7949 1.9220 1.9408 3.7520 2.6419 6.1537 1.3554 1.7333 3.5651 1.3441 4.0065 2.5726 1.9900 2.5831 1.2876 2.6388 2.3727 1.3437 1.2872 2.3846 1.9946 1.8392 1.3649 1.5047 1.3981 1.4087 1.4129 1.4429 1.5849 1.3475 2.0933 1.4183 1.6183 1.3889 1.6351 1.7403 1.7353 1.2955 2.6818 1.3181 1.3007 1.3681 1.8278 1.3950 1.3893 1.4830 5.5062 4.3936 4.7542 5.1122 1.4367 1.3785 1.3302 1.3372 1.3183 1.9129 1.8561 1.4661 2.4339 2.5976 2.6743 1.4841 1.9374 1.4360 1.6237 1.8373 1.5198 1.6706 1.5125 1.5422 2.8195 2.6999 2.7618 2.4722 3.1802 2.4098 3.0796 1.5680 1.2697 1.3663 1.1123 2.1772 1.0678 1.0691 1.0657 1.1320 1.9965 1.6930 2.1860 2.7095 1.5342 1.1237 1.1285 1.5710 6.8438 2.9270 2.8664 1.4889 1.5911 2.7203 2.5087 2.4548 1.9707 1.4051 2.8292 2.7898 1.3050 1.3549 1.3721 1.3428 1.5336 2.2292 2.3837 1.9291 6.3626 1.4854 3.2337 1.7223 1.5629 1.6941 1.3525 1.3481 4.6779 1.5649 1.4541 1.9254 2.7329 1.4231 1.4179 6.0098 1.3394 1.3139 7.8873 2.2721 2.1245 1.1021 1.0973 1.0619 1.0568 1.0579 1.0574 1.0588 1.0541 1.0826 1.0948 1.0611 1.0639 1.0785 1.0690 1.0611 1.0891 1.0723 1.0730 2.3797 1.0952 1.0927 2.3865 2.4400 1.0775 1.0662 2.5859 3.3800 2.2948 2.2135 2.1935 2.8028 5.0187 6.0191 6.0750 6.3150 6.1198 6.1393 6.2891 6.8893 6.8958 7.9162 12.7702 1.0722 1.0691 1.0656 1.0389 1.0367 1.0367 1.0370 1.0825 1.0376 1.0377 1.0377 1.0379 1.0382 1.0872 1.0712 1.0959 1.1021 1.0999 1.1039 1.1046 1.1040 1.1042 1.0994 1.1025 1.1044 1.0921 1.1042 1.1043 1.1044 1.1044 1.1042 1.1047 1.0929 1.1043 1.1041 1.1042 1.1040 1.1028 1.0901 1.0869 1.0867 1.0896 1.0869 1.0915 1.0893 1.0941 1.0912 1.0931 1.0962 1.0957 1.0969 1.0991 1.0900 1.0972 1.1004 1.0999 1.0938 1.0955 1.0945 1.0971 1.0964
temp: 298.150 k
press: 1.00000 atm
elementType: 46 15 6 6 6 6 1 6 1 6 1 1 1 6 6 6 6 1 6 1 6 1 1 1 6 6 6 6 1 6 1 6 1 1 1 6 6 6 6 6 1 1 1 1 1 7 6 8 8 6 6 6 6 1 6 1 6 1 1 1 6 1 1 1 6 6 6 6 6 6 1 1 1 1 1 1 1 1 1 6 6 6 6 5 5 8 8 8 8 6 1 1 1 6 1 1 1 6 1 1 1 6 1 1 1 6 1 1 1 6 1 1 1 6 1 1 1 6 1 1 1
symmnumber: 1
zpe: 2680710.3 jmol-1
zpe.correction: 1.021029 hartree
zpe.thermalcorrener: 1.079122 hartree
zpe.thermalcorrenthalpy: 1.080066 hartree
zpe.thermalcorrgfe: 0.929572 hartree
zpe.sumelectzpe: -2923.426613 hartree
zpe.sumelectthermal: -2923.368520 hartree
zpe.sumelectthermalent: -2923.367576 hartree
zpe.sumelectthermalfe: -2923.518070 hartree
dipole: -3.0905 1.6837 -2.3411
dipole: 4.2269
quadrupole: -289.2678 -333.3589 -316.4175
quadrupole: 0.6443 8.5359 9.6153
quadrupole: 23.7469 -20.3441 -3.4027 0.6443 8.5359 9.6153
hfenergy: -2924.4476417 hartree
pointgroup: C01 [X(C49H61B2N1O6P1Pd1)]
dipole: -1.2204692 0.5310811 -0.9969473 debye
polarizability: 942.8784437|4.8072879|861.4312666|9.1857556|14.6071112|815.5302276 unknown
InChI: InChI=1/49C.2B.N.6O.P.Pd.61H
charge 1 multiplicity 1
121 atoms
Pd -0.46613274 0.05155873 -0.75555198
P  -0.1317929 -1.67208053 0.8958347
C  -1.21675046 -1.85579436 2.36249469
C  -0.66099602 -1.980531 3.64324094
C  -2.61087622 -1.87009069 2.21851345
C  -1.48619548 -2.12824871 4.75709072
H  0.42110026 -1.95851385 3.77983369
C  -3.42952612 -2.03245365 3.33340831
H  -3.05904945 -1.72290053 1.23613749
C  -2.87182714 -2.15904599 4.6053379
H  -1.0387433 -2.21996054 5.74942402
H  -4.51450277 -2.04248569 3.2052028
H  -3.5169785 -2.27553878 5.47937
C  1.53451547 -1.56986723 1.62871084
C  2.28445875 -2.701628 1.96983392
C  2.04784352 -0.29811469 1.90750732
C  3.54885029 -2.55535101 2.53637303
H  1.88691964 -3.70206779 1.78862522
C  3.30845321 -0.15485119 2.48098255
H  1.45653664 0.58962621 1.67836019
C  4.06779254 -1.28427718 2.78290404
H  4.13360717 -3.4436235 2.7861553
H  3.70194994 0.84303685 2.6844349
H  5.06682853 -1.17220911 3.21032972
C  -0.22282915 -3.28386477 0.02992939
C  -1.42524941 -3.99989478 -0.0234499
C  0.8869836 -3.75610176 -0.68886028
C  -1.51701287 -5.16540938 -0.78233473
H  -2.30030075 -3.65412883 0.52682891
C  0.78928391 -4.9261528 -1.4400895
H  1.83427836 -3.21202016 -0.65979936
C  -0.41225368 -5.63211331 -1.49336938
H  -2.46222502 -5.71231714 -0.81337971
H  1.66318995 -5.28569913 -1.98833706
H  -0.48658807 -6.54668246 -2.08611873
C  2.28720893 1.29451073 -2.89023964
C  1.12458959 -0.74690582 -2.22209072
C  -0.02435217 -0.21737175 -2.84187543
C  -0.22725544 1.16670448 -2.67964045
C  0.98088997 2.09170068 -2.67252014
H  3.11829718 1.88825034 -2.49580566
H  1.27341712 -1.8224067 -2.12329036
H  -0.79122923 -0.8919499 -3.22450975
H  -1.17366145 1.60235732 -3.00554684
H  0.84047087 2.69649145 -3.58407143
N  2.25882994 0.04321422 -2.11720947
C  3.33321378 -0.4776787 -1.43403916
O  4.33893714 0.41061251 -1.37306359
O  3.34882842 -1.58090293 -0.94951978
C  5.42673479 0.16254482 -0.55187918
C  5.75099488 1.16046522 0.36194819
C  6.18214634 -1.00125917 -0.65977921
C  6.85120551 0.98343629 1.19817705
H  5.13640585 2.06135486 0.41195233
C  7.27586822 -1.16844373 0.18870617
H  5.91365575 -1.76593277 -1.38822003
C  7.61140295 -0.18357286 1.11837959
H  7.11043343 1.76167018 1.91941511
H  7.87280191 -2.08051229 0.1174773
H  8.47022296 -0.32415636 1.77823332
C  2.55940466 0.99446462 -4.35841621
H  1.74670554 0.41172803 -4.81702029
H  2.66327295 1.93537488 -4.91673016
H  3.49567919 0.42815793 -4.46418135
C  1.13613209 5.42883801 -0.68121705
C  0.89088547 4.38388743 -1.72630083
C  1.11632635 3.07587724 -1.53426853
C  1.61457295 2.53613204 -0.22533275
C  1.64610459 3.55806279 0.90081005
C  2.08254807 4.9286655 0.40383031
H  0.52835866 4.71971928 -2.70480839
H  1.53790741 6.33734992 -1.1593162
H  0.96093478 1.68947304 0.06703916
H  2.61315482 2.08900145 -0.36816613
H  0.63645149 3.63872475 1.32341046
H  2.30610564 3.20525606 1.70891641
H  2.12257076 5.64591619 1.23838909
H  3.10491167 4.8642894 -0.00907986
H  0.17206932 5.73755412 -0.23395192
C  -4.51989792 0.29037406 -2.15606424
C  -4.19085712 -1.19281688 -1.76208551
C  -2.4267972 3.19002591 1.53818746
C  -2.84773363 1.96533121 2.41305137
B  -1.92056289 1.25728966 0.46403389
B  -2.57277934 0.20932023 -0.98919515
O  -2.77380395 0.88259861 1.45561605
O  -1.55277914 2.56822184 0.55079818
O  -3.14073117 -1.01592198 -0.7823589
O  -3.25946165 0.96698153 -1.89279653
C  -4.25535089 2.02526602 2.96837421
H  -4.4582383 1.11463686 3.55010482
H  -4.37048344 2.89133769 3.63632394
H  -5.00410146 2.09680024 2.16907334
C  -1.84590814 1.63658615 3.51109797
H  -1.88846494 2.37426874 4.324425
H  -2.08316645 0.64621599 3.92380026
H  -0.81897482 1.6028684 3.11820446
C  -1.68620117 4.27112679 2.29522099
H  -0.79007865 3.89020428 2.79834045
H  -1.38555776 5.07386795 1.60713562
H  -2.34871712 4.70911654 3.05634359
C  -3.58222078 3.79592105 0.75442695
H  -4.27623714 4.33351959 1.41503771
H  -3.17852876 4.51027693 0.02271097
H  -4.14149382 3.02599989 0.20605344
C  -5.55617661 0.92931193 -1.24361159
H  -5.60444789 2.00681297 -1.45537805
H  -6.55421279 0.50269174 -1.41269017
H  -5.29099106 0.79503343 -0.18496866
C  -5.32963768 -1.94871619 -1.10642928
H  -5.65701191 -1.46367491 -0.17825944
H  -6.18896307 -2.02321634 -1.78861296
H  -4.99899728 -2.9687794 -0.86272456
C  -3.60578813 -2.00776281 -2.90594743
H  -3.17990839 -2.93691124 -2.50096968
H  -4.37599263 -2.26945434 -3.64434603
H  -2.80752995 -1.46161822 -3.42697736
C  -4.88436648 0.49675071 -3.61132634
H  -4.07369671 0.1846391 -4.28172343
H  -5.78965351 -0.07411474 -3.86464268
H  -5.09103563 1.56105495 -3.7931701
