program: Gaussian 09
title: 000004425
version: EM64L-G09RevD.01
frameworkgroup: C1[X(C19H21NO4)]
method: RPBEPBE
basis: SDD
operation: Freq
keyword: #p
keyword: freq=noraman
keyword: PBEPBE/SDD
title: #p freq=noraman PBEPBE/SDD
converged: YES YES NO NO
title: Mulliken charges:
elementType: O O O O N C C C C C C C C C C C C C C C C C C C H H H H H H H H H H H H H H H H H H H H H
charge: -0.204661 -0.461848 -0.162176 -0.402974 -0.149940 0.187170 0.250830 -0.260394 -0.281630 -0.517813 -0.022959 -0.517740 -0.613071 -0.410668 0.367970 -0.515834 0.163526 0.106256 -0.419675 -0.426736 0.114881 -0.361717 -0.054884 -0.573306 0.249436 0.274442 0.235252 0.242535 0.241462 0.228980 0.228952 0.238239 0.240276 0.224863 0.244909 0.258339 0.359265 0.220365 0.195435 0.235620 0.215884 0.233182 0.357520 0.221900 0.220536
chargesum: 0.00000
title: Mulliken charges with hydrogens summed into heavy atoms:
elementType: O O O O N C C C C C C C C C C C C C C C C C C C
charge: -0.204661 -0.102583 -0.162176 -0.045454 -0.149940 0.187170 0.250830 -0.010958 -0.007188 -0.040026 -0.022959 -0.047297 -0.145881 0.054471 0.367970 -0.012586 0.163526 0.106256 -0.003874 -0.191116 0.114881 -0.145832 0.178299 -0.130871
polarizability: 2.53089471e+02 -4.64144667e+00 2.12341875e+02 -3.81651356e+00 -1.01092501e+01 1.70958062e+02
1716.lowfreq: -13.9901 -11.3140 -3.3494 -0.0004 0.0007 0.0008 35.4031 49.0785 63.0452
frequency: 35.2579 49.0455 63.0219 76.7100 95.4670 109.8330 145.7894 159.0920 207.9747 218.7652 237.1064 242.5577 262.5700 267.4095 272.4922 306.2524 324.5267 335.2528 335.5577 346.6904 351.3380 397.4849 406.4739 411.0289 453.2256 459.7060 480.6666 504.2683 521.9453 545.8365 560.2873 573.0883 579.6989 589.9934 607.6317 612.2328 648.1520 678.7596 689.5620 715.7216 741.8923 760.8742 771.4671 781.0523 803.4962 815.5592 829.8909 863.4742 895.7631 900.2651 913.7622 924.0308 931.8841 942.8466 954.0914 960.2761 978.3934 984.0180 1004.6656 1013.9018 1019.1345 1045.3385 1051.7957 1072.3373 1087.8815 1094.2169 1110.2612 1120.6985 1130.3432 1144.7245 1151.9383 1168.6722 1178.3396 1181.2162 1196.8779 1204.7165 1225.2866 1227.5207 1233.8762 1243.7616 1259.9682 1261.7194 1267.8207 1276.7250 1280.7988 1293.2354 1301.9420 1310.4958 1326.1006 1332.9543 1340.3157 1357.1017 1370.7865 1387.3648 1408.3909 1427.5537 1436.7552 1441.4763 1455.6228 1458.0918 1462.1610 1463.1704 1480.5028 1491.6818 1623.5633 1637.6559 1645.1306 1658.8142 2892.8727 2915.0028 2965.8410 2993.4422 2994.1888 2998.3538 3000.1590 3003.7629 3009.0058 3046.7071 3049.5626 3061.5089 3065.9915 3082.1539 3086.4725 3102.1085 3109.6917 3139.7579 3198.7672 3231.3981 3578.9155
redmass: 6.3911 5.3692 3.5534 4.6458 2.6010 3.6410 4.0035 3.2802 3.4781 3.2146 4.4575 5.4572 2.8818 5.2702 3.8818 3.7823 1.1754 3.2980 3.9004 3.3143 3.4664 3.5761 3.5564 2.4445 3.4497 4.9357 4.0133 3.4545 2.9388 3.8896 3.1577 3.7459 4.4136 4.2861 3.5947 4.9529 2.0804 3.7273 3.9081 1.3642 4.2019 2.6398 2.3082 1.8554 2.6588 3.5534 3.1675 2.6489 3.6732 1.5186 1.4557 2.3873 2.6478 3.0902 1.6511 1.8409 2.6344 2.1605 1.7156 1.4909 2.7394 2.0517 2.3268 4.0756 2.4612 2.2422 2.6180 2.7672 2.1213 1.9409 1.5947 1.8579 2.2402 2.1464 1.3853 1.5681 1.3724 1.4134 1.5501 1.5277 1.8077 1.7086 1.6460 1.2421 1.9582 1.6923 1.5034 1.4322 1.3855 1.3637 1.5528 1.3246 1.5318 1.5603 7.0572 1.2070 3.3198 1.1044 1.1163 1.1187 1.0999 1.1120 1.0855 3.4974 8.7315 10.7256 8.1636 4.7142 1.0667 1.0705 1.0613 1.0625 1.0909 1.0641 1.0803 1.0667 1.0920 1.0897 1.0850 1.1030 1.1025 1.0997 1.0611 1.0932 1.0874 1.0952 1.1143 1.0637 1.0662
irintensity: 1.7541 1.1229 0.0429 1.3762 0.1046 2.4054 2.4596 0.4371 0.9196 5.3983 0.8573 6.0382 2.2332 3.3990 6.3574 12.2512 106.1236 1.5114 10.8215 9.9621 8.3890 1.8698 3.5527 3.1706 3.5486 0.4728 4.7005 1.8306 4.2860 1.1888 1.4340 5.8763 10.4098 0.3145 1.2009 7.5760 6.9182 10.2676 10.7519 46.4313 15.0844 14.5265 28.4773 22.3319 13.6589 4.6490 46.0425 22.6436 24.8043 11.1819 5.4644 39.4431 16.7083 14.6797 42.6913 59.6503 26.9785 18.0032 27.4179 12.8186 48.1117 35.8627 30.9731 36.6358 21.9140 69.6696 14.4917 26.9589 10.6412 0.8883 69.9909 18.7538 15.8484 13.5731 15.5202 19.5715 18.9092 10.1637 10.4419 12.7619 34.7533 23.5437 44.1762 2.6628 32.6927 29.3884 15.1825 16.4786 3.7846 22.0051 6.7699 4.9778 20.6438 59.9134 0.3980 12.5857 24.9811 26.2075 20.5574 9.5116 23.2208 5.6425 14.1794 70.1380 25.4924 109.7072 53.5663 7.2562 54.9870 48.2436 23.2833 7.8287 9.5577 31.2481 24.2912 21.1674 33.6391 21.1102 13.8576 14.0238 29.2480 14.7601 13.3054 8.2049 16.1841 18.5820 24.0912 165.9370 43.7407
temp: 298.150 k
press: 1.00000 atm
elementType: 8 8 8 8 7 6 6 6 6 6 6 6 6 6 6 6 6 6 6 6 6 6 6 6 1 1 1 1 1 1 1 1 1 1 1 1 1 1 1 1 1 1 1 1 1
symmnumber: 1
zpe: 954156.9 jmol-1
zpe.correction: 0.363419 hartree
zpe.thermalcorrener: 0.383646 hartree
zpe.thermalcorrenthalpy: 0.384590 hartree
zpe.thermalcorrgfe: 0.316053 hartree
zpe.sumelectzpe: -1090.456551 hartree
zpe.sumelectthermal: -1090.436324 hartree
zpe.sumelectthermalent: -1090.435380 hartree
zpe.sumelectthermalfe: -1090.503918 hartree
dipole: -5.4177 -3.6948 2.6218
dipole: 7.0623
quadrupole: -150.6106 -133.1780 -136.6545
quadrupole: -11.4015 8.1050 -3.4130
quadrupole: -10.4629 6.9697 3.4932 -11.4015 8.1050 -3.4130
hfenergy: -1090.8199704 hartree
pointgroup: C01 [X(C19H21N1O4)]
dipole: -2.1980534 -1.3395614 1.0461332 debye
polarizability: 252.5829309|-6.5509253|212.5925536|-4.0845621|-10.4758698|171.2139236 unknown
InChI: InChI=1S/C19H21NO4/c1-2-8-20-9-7-18-15-11-3-4-12(21)16(15)24-17(18)13(22)5-6-19(18,23)14(20)10-11/h2-4,14,17,21,23H,1,5-10H2
charge 0 multiplicity 1
45 atoms
O  2.438224 -0.015716 -1.458038
O  -1.218795 2.571249 -0.077235
O  3.624981 2.158663 -0.149931
O  3.871989 -2.525464 -0.84357
N  -2.549842 0.266518 0.049341
C  0.268272 0.613096 -0.543482
C  -0.482238 1.452774 0.535771
C  -1.56007 0.492497 1.158168
C  1.589912 1.197786 -1.129318
C  -0.738988 0.238118 -1.672084
C  0.816202 -0.647613 0.100876
C  0.483785 2.084742 1.546833
C  -0.986021 -0.797109 1.836764
C  -1.976001 -0.488739 -1.105993
C  0.234884 -1.384961 1.138477
C  1.518968 2.961602 0.789893
C  2.371504 2.117088 -0.149442
C  2.024649 -0.991523 -0.522464
C  -3.865217 -0.259341 0.501724
C  0.903812 -2.579268 1.511936
C  2.685324 -2.187421 -0.178891
C  2.092009 -2.975351 0.848274
C  -4.958135 -0.006419 -0.518052
C  -5.814457 -0.949878 -0.981671
H  -2.103459 1.071173 1.931633
H  1.442647 1.730026 -2.085544
H  -0.240028 -0.410992 -2.414787
H  -1.049421 1.166645 -2.186929
H  1.004629 1.310087 2.139448
H  -0.095928 2.719322 2.240903
H  -1.79702 -1.548178 1.922937
H  -0.7103 -0.539625 2.879856
H  -2.758213 -0.563478 -1.881901
H  -1.708104 -1.528903 -0.80936
H  2.192713 3.49572 1.480836
H  0.951907 3.707999 0.19881
H  -2.093385 2.143006 -0.344728
H  -4.119187 0.270487 1.442371
H  -3.82765 -1.349459 0.73886
H  0.513426 -3.203133 2.324075
H  2.58947 -3.906374 1.152048
H  -5.040169 1.033721 -0.866817
H  4.258981 -3.354925 -0.467501
H  -6.609038 -0.703452 -1.694426
H  -5.747622 -1.996299 -0.657469
