program: Gaussian 09
title: 000075055
version: EM64L-G09RevD.01
frameworkgroup: C1[X(C12H16O2)]
method: RPBEPBE
basis: SDD
operation: Freq
keyword: #pfreq=noraman
keyword: PBEPBE/SDD
title: #p freq=noraman PBEPBE/SDD
converged: YES YES NO NO
title: Mulliken charges:
elementType: O O C C C C C C C C C C C C H H H H H H H H H H H H H H H H
charge: -0.426205 -0.437385 -0.158745 -0.446076 -0.439745 -0.411393 -0.395953 -0.388815 0.367771 0.102409 -0.353266 -0.533413 -0.414235 0.321386 0.163116 0.217460 0.184323 0.213931 0.217173 0.192542 0.203090 0.205849 0.187467 0.193948 0.202097 0.234199 0.242308 0.247440 0.355128 0.353593
chargesum: 0.00000
title: Mulliken charges with hydrogens summed into heavy atoms:
elementType: O O C C C C C C C C C C C C
charge: -0.071077 -0.083793 0.004371 -0.044293 -0.008641 -0.015761 -0.002636 0.007230 0.367771 0.102409 -0.119067 -0.291106 -0.166795 0.321386
polarizability: 1.83024770e+02 2.14042878e+00 1.30088095e+02 -4.56260163e+00 -5.55310235e+00 8.70809327e+01
1716.lowfreq: -31.4816 -11.5784 -0.0005 -0.0004 0.0005 8.6459 37.7666 58.8529 101.4289
frequency: 35.7341 58.4629 101.3557 167.8338 215.0958 226.6039 227.4258 246.6311 308.0899 326.8009 338.5517 347.4237 381.1433 429.2047 432.2884 461.6651 481.4329 496.3262 544.1654 570.3161 613.8416 712.1535 726.5835 759.6088 785.3170 808.7332 817.6896 837.3386 857.6596 884.3785 894.2449 916.1132 942.7371 947.0324 992.0797 1047.3422 1052.3430 1061.9894 1084.8225 1110.4735 1124.4963 1137.3992 1142.9178 1174.9900 1178.0931 1212.6328 1231.8972 1256.6662 1258.9941 1275.7339 1286.1794 1307.8869 1314.5776 1319.2718 1335.4702 1340.6096 1346.5734 1361.2456 1399.7637 1448.6565 1461.5628 1463.6311 1467.7966 1475.5185 1481.7607 1497.2664 1600.3652 1638.6587 2862.8858 2960.9578 2966.7288 2969.2117 2969.9194 2974.3054 3024.7512 3029.5419 3031.7096 3035.9869 3044.9708 3140.8758 3146.1950 3176.6858 3574.8364 3583.9355
redmass: 3.4673 4.3572 3.5552 3.7059 3.2186 2.9694 3.2255 3.3329 1.2281 4.0162 1.9904 1.1107 3.6538 2.8651 2.8112 3.0599 2.0765 4.2969 3.2700 4.5052 3.9838 3.3659 5.7622 2.3736 1.4638 1.4407 3.3899 1.7401 1.6839 1.7092 1.9624 1.8274 1.3628 3.9033 2.4060 1.7248 1.5785 1.3184 1.7372 2.5188 1.6587 2.0006 1.3042 1.4378 1.4131 1.6131 1.4940 1.3102 1.7707 1.6148 1.2429 1.3419 1.7882 1.4375 1.3762 1.4582 1.4948 1.5379 3.5711 3.6580 1.0896 1.0943 1.0952 1.0854 1.0988 3.1431 6.4956 6.7345 1.0803 1.0643 1.0634 1.0624 1.0611 1.0619 1.0971 1.0953 1.1008 1.1015 1.1035 1.0921 1.0882 1.0959 1.0652 1.0660
irintensity: 0.0291 0.0525 0.2055 0.8811 0.4493 0.7839 1.4012 1.5423 75.8651 12.4731 1.6328 168.5072 8.1231 3.3621 1.2004 13.4079 6.4683 15.2029 7.1740 1.5123 6.8879 4.2471 3.0170 2.1919 0.0559 14.5793 2.2957 56.3061 15.6921 5.8156 7.6978 0.8248 0.0970 63.2720 9.9197 0.7613 0.1994 0.1774 6.2146 0.5449 254.4360 11.6199 116.6137 13.2684 0.8695 38.3098 4.5605 1.8172 35.4906 11.2108 3.1243 6.8710 5.3152 2.9561 0.4312 0.7062 0.8937 2.3065 19.7127 9.4552 4.7255 11.7535 6.5178 19.2539 3.2855 123.6638 50.3921 107.1132 37.5338 37.2964 41.0572 30.2422 21.9459 26.1042 73.1118 76.8856 10.7526 7.2163 115.7747 9.4882 8.4046 6.9921 27.8042 37.9660
temp: 298.150 k
press: 1.00000 atm
elementType: 8 8 6 6 6 6 6 6 6 6 6 6 6 6 1 1 1 1 1 1 1 1 1 1 1 1 1 1 1 1
symmnumber: 1
zpe: 665621.0 jmol-1
zpe.correction: 0.253522 hartree
zpe.thermalcorrener: 0.266519 hartree
zpe.thermalcorrenthalpy: 0.267463 hartree
zpe.thermalcorrgfe: 0.214244 hartree
zpe.sumelectzpe: -616.262890 hartree
zpe.sumelectthermal: -616.249892 hartree
zpe.sumelectthermalent: -616.248948 hartree
zpe.sumelectthermalfe: -616.302167 hartree
dipole: 2.2124 0.5573 -0.2533
dipole: 2.2955
quadrupole: -78.7327 -84.4609 -86.9355
quadrupole: -5.4996 0.2320 -0.7012
quadrupole: 4.6437 -1.0846 -3.5591 -5.4996 0.2320 -0.7012
hfenergy: -616.5164112 hartree
pointgroup: C01 [X(C12H16O2)]
dipole: 0.870804 0.2223506 -0.088771 debye
polarizability: 182.9730011|2.2323909|130.6728376|-5.1391089|-2.0847497|86.5479592 unknown
InChI: InChI=1S/C12H16O2/c13-10-6-7-11(12(14)8-10)9-4-2-1-3-5-9/h6-9,13-14H,1-5H2
charge 0 multiplicity 1
30 atoms
O  -0.716078 2.371358 -0.443187
O  -4.551487 -0.503114 0.332943
C  1.17436 0.107415 -0.292653
C  1.926308 -1.170965 -0.745952
C  1.809568 0.644628 1.0299
C  3.437507 -0.897853 -0.929265
C  3.324787 0.913287 0.869279
C  4.07239 -0.346278 0.369089
C  -0.339216 -0.06805 -0.157808
C  -1.20081 1.065277 -0.222675
C  -0.956525 -1.323555 0.072951
C  -2.59864 0.95662 -0.06733
C  -2.348934 -1.464151 0.237012
C  -3.167026 -0.314295 0.165207
H  1.379149 0.865963 -1.089451
H  1.484307 -1.558006 -1.684132
H  1.802943 -1.961684 0.022086
H  1.645032 -0.114898 1.820581
H  1.28698 1.561151 1.36811
H  3.58297 -0.164523 -1.749804
H  3.952299 -1.827689 -1.23939
H  3.750585 1.254318 1.832716
H  3.477995 1.740001 0.143558
H  4.029894 -1.12853 1.154976
H  5.142597 -0.115324 0.204558
H  -0.334729 -2.222785 0.123706
H  -3.207768 1.865511 -0.133651
H  -2.811286 -2.438737 0.414572
H  0.260983 2.355071 -0.598213
H  -5.034054 0.357139 0.258666
