program: Gaussian 09
title: 000075045
version: EM64L-G09RevD.01
frameworkgroup: C1[X(C8H5NOS)]
method: RPBEPBE
basis: SDD
operation: Freq
keyword: #p
keyword: freq=noraman
keyword: PBEPBE/SDD
title: #p freq=noraman PBEPBE/SDD
converged: NO YES NO NO
title: Mulliken charges:
elementType: S O N C C C C C C C C H H H H H
charge: 0.165298 -0.202798 0.310328 0.396893 -0.341835 -0.328211 0.491500 -0.369904 -0.367214 -0.202739 -0.769413 0.244375 0.280751 0.260980 0.261923 0.170066
chargesum: 0.00000
title: Mulliken charges with hydrogens summed into heavy atoms:
elementType: S O N C C C C C C C C
charge: 0.165298 -0.202798 0.310328 0.396893 -0.097459 -0.047460 0.491500 -0.108924 -0.105291 -0.032673 -0.769413
polarizability: 2.79643275e+02 -1.70609957e+00 9.07497934e+01 -3.82384430e-02 -1.54485180e-03 4.05910940e+01
1716.lowfreq: -11.6335 -5.4388 -4.4291 -0.0008 0.0011 0.0026 25.1019 47.8507 120.5538
frequency: 25.0665 47.8385 120.5529 188.3478 201.7757 303.9314 335.6816 374.6933 412.1802 433.9032 434.5251 511.7721 523.3752 627.8456 670.2414 729.0957 815.5453 836.5111 852.0945 905.6548 961.2658 987.6951 1002.8823 1003.1808 1110.0157 1173.1153 1217.1862 1279.5440 1296.9273 1348.1878 1392.8244 1424.9565 1493.3744 1554.0142 1601.0284 1622.5851 2187.7384 2876.4544 3128.5189 3151.0785 3169.0522 3172.7124
redmass: 10.5041 10.2679 7.7572 8.0565 3.2878 10.7159 4.0797 8.2539 2.9478 8.7896 8.2337 7.1932 2.8639 7.2119 7.0772 3.2970 5.1222 1.3466 1.4027 8.0291 1.4348 1.4924 2.6938 1.5490 1.3429 1.1658 2.4363 4.4377 1.3608 2.8458 1.6283 3.9255 2.7476 7.9356 6.1337 6.9654 12.8803 1.0852 1.0899 1.0886 1.0959 1.0976
irintensity: 0.7153 1.3526 5.3705 9.0936 5.2633 4.1682 5.1641 2.5353 0.5198 3.6335 1.9057 17.5569 21.6356 0.4914 1.1495 0.5606 91.0678 32.0334 44.5273 45.8476 5.5098 2.2257 0.1210 4.1124 12.7293 54.1412 87.2767 13.6140 13.4638 11.0313 15.6103 19.0954 14.3906 118.1973 490.4896 27.8113 1595.1746 139.5646 8.7726 0.2256 6.0100 3.0296
temp: 298.150 k
press: 1.00000 atm
elementType: 16 8 7 6 6 6 6 6 6 6 6 1 1 1 1 1
symmnumber: 1
zpe: 284142.8 jmol-1
zpe.correction: 0.108224 hartree
zpe.thermalcorrener: 0.117928 hartree
zpe.thermalcorrenthalpy: 0.118872 hartree
zpe.thermalcorrgfe: 0.071121 hartree
zpe.sumelectzpe: -835.124719 hartree
zpe.sumelectthermal: -835.115016 hartree
zpe.sumelectthermalent: -835.114072 hartree
zpe.sumelectthermalfe: -835.161823 hartree
dipole: 0.5222 1.9380 -0.0027
dipole: 2.0071
quadrupole: -96.3367 -62.5409 -72.1832
quadrupole: -8.5131 -0.0126 0.0013
quadrupole: -19.3164 14.4794 4.8370 -8.5131 -0.0126 0.0013
hfenergy: -835.2329438 hartree
pointgroup: C01 [X(C8H5N1O1S1)]
dipole: 0.2221099 0.7452119 0.1374682 debye
dipolederiv: -1.4693863 0.0832002 0.0217742 0.0909655 -0.0482688 -0.0009799 0.0343601 -0.0016184 -0.0455633 -1.2777577 -0.1134318 -0.0171956 -0.6646983 -0.5280373 -0.0339555 -0.1194266 -0.0359199 -0.3378995 -3.035266 0.1677913 0.0470402 0.1822104 -0.1455966 -0.0249341 0.0414631 -0.0243563 -0.0222725 -1.2723468 0.0471116 0.0145845 0.2614856 -0.1209686 -0.0259441 0.0542875 -0.0250078 0.0064491 0.3944566 -0.1179156 -0.0244953 0.1210556 0.0760827 0.0389599 0.0196556 0.0399975 -0.1276822 0.3142058 0.0965467 0.0161905 -0.1796483 0.0458878 0.0261689 -0.0358152 0.0249072 -0.0840601 1.8704397 -0.0886215 -0.0272332 -0.0963093 0.2916777 0.0349992 -0.0251082 0.0347378 0.1147543 -0.4990601 0.1529705 0.0304821 0.3760242 -0.043637 0.0195187 0.0720163 0.0208998 -0.1545858 -0.5500024 -0.1115337 -0.0187834 -0.2791391 0.0134104 0.0334951 -0.0505257 0.0324222 -0.1513939 2.1401731 0.0353553 -0.0024186 0.1568881 0.7189571 0.1139667 0.0200278 0.11435 0.1283155 3.2165763 -0.1930727 -0.0503016 -0.2108259 -0.030811 0.0062306 -0.0595837 0.0065214 -0.0578438 0.0297685 0.0914246 0.017658 0.0681463 -0.0272352 -0.03494 0.0132339 -0.0350147 0.1513268 0.0642747 -0.0670277 -0.0121858 -0.0250506 0.0331177 -0.0230719 -0.0043258 -0.0228626 0.1524488 0.0319002 -0.0771834 -0.0138415 -0.0750146 0.0114847 -0.0299089 -0.0131495 -0.0298995 0.1673372 0.0481106 0.0698081 0.0135933 0.0655138 -0.0040921 -0.0327904 0.0130368 -0.0328647 0.1632956 -0.0060861 0.0245782 0.0051322 0.2083964 -0.2419716 -0.0668142 0.0398536 -0.0662922 0.0973739 unknown
polarizability: 279.4722532|-5.5412602|89.2012151|-2.1785971|9.1283104|42.3106943 unknown
InChI: InChI=1S/C8H5NOS/c10-5-7-1-3-8(4-2-7)9-6-11/h1-5H
charge 0 multiplicity 1
16 atoms
S  5.135056 -0.243037 -0.107712
O  -4.159891 -0.635629 -0.136273
N  2.307024 -0.057344 -0.058422
C  -1.889735 0.219312 0.012566
C  -1.092242 1.374963 0.225944
C  -1.258921 -1.033545 -0.224478
C  0.934086 0.034246 -0.033794
C  0.310226 1.292548 0.204712
C  0.139174 -1.132325 -0.248654
C  -3.368055 0.329431 0.0393
C  3.512736 -0.137342 -0.072537
H  -1.576731 2.341837 0.408826
H  -1.890657 -1.91329 -0.386764
H  0.932621 2.177261 0.367587
H  0.636148 -2.090022 -0.43028
H  -3.758439 1.360337 0.23498
