program: Gaussian 09
title: 000075026
version: EM64L-G09RevD.01
frameworkgroup: C1[X(C7H15NO2)]
method: RPBEPBE
basis: SDD
operation: Freq
keyword: #p
keyword: freq=noraman
keyword: PBEPBE/SDD
title: #p freq=noraman PBEPBE/SDD
converged: NO YES NO NO
title: Mulliken charges:
elementType: O O N C C C C C C C H H H H H H H H H H H H H H H
charge: -0.294935 -0.284204 -0.618620 -0.365239 -0.346863 -0.390948 -0.354356 -0.270591 -0.694022 0.290194 0.191111 0.191144 0.189179 0.189211 0.209565 0.209531 0.195647 0.195597 0.224519 0.224354 0.216553 0.209919 0.209969 0.334415 0.338871
chargesum: 0.00000
title: Mulliken charges with hydrogens summed into heavy atoms:
elementType: O O N C C C C C C C
charge: -0.294935 -0.284204 0.054666 0.017015 0.031527 0.028149 0.036888 0.178282 -0.057581 0.290194
polarizability: 1.21608229e+02 -2.21458429e+00 8.48840201e+01 8.03164145e-03 -1.07245056e-02 6.63630554e+01
1716.lowfreq: -4.2192 -0.0007 -0.0003 0.0005 7.5731 25.1020 32.3481 59.6654 60.6924
frequency: 30.6172 57.4312 59.6610 74.1515 113.7015 136.1408 152.8329 168.2087 224.2364 228.6821 273.5707 412.7883 421.9107 486.0397 498.9823 518.4470 620.7764 706.1688 728.1031 749.1018 797.8608 829.7499 885.9433 889.1006 988.8512 1000.8563 1012.9622 1050.9990 1058.0051 1071.9852 1085.1668 1126.4011 1152.5510 1196.4168 1238.7515 1244.2559 1274.6042 1288.0605 1292.3180 1294.6179 1306.4430 1344.1247 1357.8670 1386.9428 1388.8660 1466.2355 1468.0612 1473.0089 1476.1121 1479.8350 1487.4443 1492.9050 1586.1506 1681.5305 2955.8679 2961.0497 2970.6303 2972.8547 2989.5262 2992.7533 2998.9503 3009.4261 3031.1937 3044.4996 3068.9112 3072.6805 3073.2361 3559.8166 3719.4128
redmass: 4.3044 2.0869 4.0763 2.5209 1.9415 2.1236 4.1304 3.0423 1.1390 5.0099 3.4148 2.8728 3.5866 1.1824 3.0198 1.0507 5.9489 10.9062 1.0667 1.0923 1.1520 5.1401 1.1952 1.8817 1.1426 7.4502 3.8134 3.0964 2.1595 2.6448 2.0883 2.8030 1.4639 1.5120 1.2854 1.2890 1.1092 1.5218 1.0890 1.1054 1.9829 1.5139 1.6448 1.7032 1.2180 1.0713 1.0725 1.0717 1.0424 1.0741 1.0841 1.0946 1.2207 7.2202 1.0587 1.0590 1.0591 1.0365 1.0596 1.0978 1.0566 1.1014 1.1036 1.1047 1.1012 1.0992 1.1073 1.0443 1.1059
irintensity: 0.2526 2.6775 1.2156 0.2161 3.1209 0.0847 4.6081 7.5998 0.0294 1.3792 7.9230 0.8603 9.7210 316.9481 1.2719 18.1475 0.8533 32.4495 12.6916 0.1313 1.3453 25.8814 1.2602 6.3666 0.1073 103.6526 14.9473 89.8716 2.3311 20.3139 5.8351 1.6797 1.4824 0.0002 0.8921 0.0092 0.2946 146.0486 0.1418 1.0005 299.0498 21.1861 4.6651 29.2562 9.4784 0.0359 0.1804 1.5104 12.5970 0.4518 5.1225 23.6005 102.7238 370.7713 0.2032 7.4589 89.7328 34.0399 14.9567 0.2461 56.2646 0.5472 29.4754 18.3704 48.6781 52.9075 130.8787 58.6447 47.9235
temp: 298.150 k
press: 1.00000 atm
elementType: 8 8 7 6 6 6 6 6 6 6 1 1 1 1 1 1 1 1 1 1 1 1 1 1 1
symmnumber: 1
zpe: 569765.4 jmol-1
zpe.correction: 0.217012 hartree
zpe.thermalcorrener: 0.229684 hartree
zpe.thermalcorrenthalpy: 0.230628 hartree
zpe.thermalcorrgfe: 0.176593 hartree
zpe.sumelectzpe: -480.133670 hartree
zpe.sumelectthermal: -480.120998 hartree
zpe.sumelectthermalent: -480.120054 hartree
zpe.sumelectthermalfe: -480.174089 hartree
dipole: -0.5258 -2.5083 0.0059
dipole: 2.5628
quadrupole: -55.1655 -64.3077 -62.1322
quadrupole: -13.8798 0.0236 -0.0074
quadrupole: 5.3697 -3.7726 -1.5970 -13.8798 0.0236 -0.0074
hfenergy: -480.3506824 hartree
pointgroup: C01 [X(C7H15N1O2)]
dipole: -0.2130429 0.9851687 -0.0268779 debye
dipolederiv: -1.8722926 -0.0048775 -0.0044603 0.2094408 -0.4978445 0.0054463 -0.0090564 0.0047962 -0.3055569 -0.749185 0.0814151 -0.0031269 0.1861081 -1.0640149 0.0183424 -0.0055083 0.01804 -0.3614189 -0.9789794 -0.4881417 0.0117305 -0.5203157 -0.7325771 -0.0019451 0.0127326 -0.0018605 -0.7520496 -0.0443965 0.0190935 -0.0011487 0.0730955 0.0896013 0.00234 -0.0024642 0.002186 0.1904715 -0.029349 -0.0073906 -0.000452 -0.0665008 0.0771812 0.0020378 0.0005711 0.0023154 0.1836062 -0.1307068 -0.0002739 -0.0008775 0.0077646 0.067244 0.0020881 -0.0011899 0.0019194 0.157813 0.0205293 0.0073737 -0.0006367 0.0635317 0.1001244 0.001846 -0.0017928 0.001393 0.1748856 0.923982 0.1221242 -0.0010763 0.2755499 0.287731 0.0027708 -0.0052371 0.0025173 0.3679325 -0.0800396 0.0432744 -0.0015138 0.0028433 0.0533657 0.000876 -0.0004483 0.0011412 0.0964048 2.2430649 0.250119 -0.0014854 -0.1181773 1.6408857 -0.0336282 0.0071013 -0.0325072 0.3374048 0.0443655 0.0009522 0.0042157 -0.0008259 -0.0483656 -0.1149538 0.0051636 -0.1395378 -0.0825236 0.0444389 -0.0002482 -0.0032737 -0.0018834 -0.0375813 0.1130239 -0.004102 0.137605 -0.0932946 0.0351211 -0.0028982 -0.000634 0.0069522 -0.0507788 -0.1178401 0.003924 -0.1420154 -0.0854185 0.035171 -0.003848 0.0016385 0.0060094 -0.0397768 0.1159272 -0.0032982 0.1400397 -0.0964137 0.0597176 0.0048497 0.0119968 0.0107099 -0.0273074 -0.1059677 -0.0008328 -0.1234064 -0.0678544 0.0598825 0.0035023 -0.0113532 0.0100583 -0.0174859 0.1038304 0.001256 0.1212249 -0.0776236 0.0283315 0.0265866 0.0274384 -0.000489 -0.0516201 -0.1232996 0.005179 -0.1518227 -0.0847247 0.0284554 0.0244596 -0.0278179 -0.0013929 -0.0399943 0.1214046 -0.0044003 0.1501129 -0.0965227 -0.0218088 -0.0108706 -0.0136529 -0.0703367 -0.0120536 0.0795552 0.0032901 0.1008758 -0.0738384 -0.0221968 -0.0098318 0.0143504 -0.0700818 -0.0206312 -0.0825543 0.0001922 -0.1036182 -0.0656984 -0.1754073 -0.1012703 0.0017429 -0.1385951 -0.0009846 0.002147 0.0027072 0.0021834 0.0999174 0.0788238 0.001878 -0.0192764 0.0520017 -0.0224573 -0.1246874 0.0283961 -0.1398758 -0.0837901 0.0786792 0.0024403 0.0197185 0.0503325 -0.010232 0.1214441 -0.0302708 0.1364485 -0.0959687 0.2096714 0.0083599 -0.0007135 0.0451399 0.1843639 0.0059059 -0.0016602 0.005838 0.4095238 0.2141275 0.0332222 -0.0013324 -0.0109391 0.1732079 0.0058906 -0.0002517 0.0060074 0.4047372 unknown
polarizability: 121.5785941|2.4475088|84.9021214|0.1021196|-0.4528792|66.374589 unknown
InChI: InChI=1S/C7H15NO2/c1-2-3-4-5-6-10-7(8)9/h2-6,8H2,1H3
charge 0 multiplicity 1
25 atoms
O  2.123805 0.567511 -0.002309
O  3.605662 -1.269473 0.047531
N  4.364429 0.953966 -0.007009
C  -1.563387 -0.44204 0.009433
C  -2.873048 0.378069 -0.012617
C  -0.299009 0.449097 -0.005273
C  -4.142662 -0.503634 0.001967
C  0.981818 -0.385753 0.016863
C  -5.44763 0.321254 -0.019645
C  3.398101 -0.030117 0.015634
H  -1.546537 -1.126202 -0.864428
H  -1.552913 -1.088434 0.911696
H  -2.892945 1.062621 0.860976
H  -2.887008 1.024761 -0.914712
H  -0.30651 1.126743 0.870245
H  -0.300788 1.088766 -0.908964
H  -4.120991 -1.187589 -0.871024
H  -4.126539 -1.150227 0.903133
H  1.054703 -1.010926 0.926518
H  1.059082 -1.051782 -0.86295
H  -6.339924 -0.33118 -0.005795
H  -5.506067 0.993006 0.857648
H  -5.503201 0.951186 -0.927599
H  4.10026 1.935501 -0.032851
H  5.3410 0.675276 0.002632
