program: Gaussian 09
title: 000075016
version: EM64L-G09RevD.01
frameworkgroup: C1[X(C6H3ClFNO2)]
method: RPBEPBE
basis: SDD
operation: Freq
keyword: #p
keyword: freq=noraman
keyword: PBEPBE/SDD
title: #p freq=noraman PBEPBE/SDD
converged: NO NO NO NO
title: Mulliken charges:
elementType: Cl F O O N C C C C C C H H H
charge: 0.022540 -0.129573 -0.201470 -0.166954 0.026933 0.265185 0.341066 -0.327510 -0.259668 -0.191912 -0.202461 0.299939 0.252280 0.271605
chargesum: 0.00000
title: Mulliken charges with hydrogens summed into heavy atoms:
elementType: Cl F O O N C C C C C C
charge: 0.022540 -0.129573 -0.201470 -0.166954 0.026933 0.265185 0.341066 -0.027571 -0.259668 0.060368 0.069144
polarizability: 1.28583206e+02 3.93865576e+00 1.05362990e+02 -1.14928384e-02 1.51322483e-03 3.29987467e+01
1716.lowfreq: -26.9484 -13.7014 -11.4512 -6.4291 -0.0013 0.0020 0.0024 86.9649 176.0569
frequency: -26.8732 86.9627 176.0538 189.8612 258.1147 264.5082 339.3546 364.9775 402.2767 466.0560 531.3456 549.2991 581.1089 669.5642 696.3965 718.3704 789.6466 798.9552 828.8646 927.5443 988.5302 1066.8425 1086.7026 1163.7393 1197.6014 1202.2619 1221.3826 1373.8862 1384.4533 1429.8283 1452.9478 1584.3971 1595.1615 3164.3940 3180.6283 3192.3977
redmass: 14.2226 17.8104 17.6637 4.9284 6.5550 13.6314 16.2393 10.5945 9.8864 5.5351 3.8208 8.8307 7.8748 8.6058 11.2436 3.7890 7.4685 1.4822 8.7977 1.3593 1.3256 2.1030 7.3481 1.3587 3.3640 2.3015 3.0382 8.1215 10.6250 2.3874 3.8846 8.0200 7.7531 1.0880 1.0931 1.0989
irintensity: 0.3368 0.5224 1.0467 0.6297 0.1655 0.6704 0.5759 0.4913 1.8298 3.4440 0.1382 3.2037 7.0977 0.1014 53.4290 37.8719 1.7251 48.1354 26.0861 0.4082 1.9585 23.8304 38.9168 10.9158 161.3305 94.6952 29.7729 56.6164 13.8988 3.9490 160.8556 0.0352 19.2199 4.0964 2.0920 4.9629
temp: 298.150 k
press: 1.00000 atm
elementType: 17 9 8 8 7 6 6 6 6 6 6 1 1 1
symmnumber: 1
zpe: 214875.7 jmol-1
zpe.correction: 0.081842 hartree
zpe.thermalcorrener: 0.090212 hartree
zpe.thermalcorrenthalpy: 0.091156 hartree
zpe.thermalcorrgfe: 0.047673 hartree
zpe.sumelectzpe: -994.649749 hartree
zpe.sumelectthermal: -994.641379 hartree
zpe.sumelectthermalent: -994.640435 hartree
zpe.sumelectthermalfe: -994.683918 hartree
dipole: -3.0807 4.6616 0.0047
dipole: 5.5876
quadrupole: -78.8934 -64.8903 -68.4251
quadrupole: 0.7562 0.0180 -0.0017
quadrupole: -8.1571 5.8459 2.3112 0.7562 0.0180 -0.0017
hfenergy: -994.731591 hartree
pointgroup: C01 [X(C6H3Cl1F1N1O2)]
dipole: -1.5316731 -1.5769168 -0.0018567 debye
dipolederiv: -0.4482189 0.3018751 0.0000516 0.3202591 -0.2974908 -0.0000439 0.0001093 -0.0001441 -0.0103945 -0.1603224 -0.0727012 0.0000577 -0.04597 -0.8013386 0.0002205 -0.0000693 0.000131 -0.0846055 -0.7897854 0.1969218 0.0001835 0.1236656 -0.5815251 -0.0005194 -0.0011838 0.0010885 -0.225152 -0.5440969 -0.1728373 -0.0000411 -0.141858 -0.6556652 0.001001 -0.000396 -0.001042 -0.201726 1.7171031 0.0497053 0.0004682 0.1867358 1.0835146 -0.0003435 0.0003422 -0.0003567 0.2030905 -0.6402913 -0.0702257 -0.0004622 -0.258225 -0.0404535 -0.0000472 0.0006697 0.0000467 0.0456949 0.2418986 0.3428085 -0.0000642 0.0459162 0.7959824 -0.0003492 0.0004842 -0.0000057 0.1587847 0.0836397 -0.0581868 -0.0001445 0.2758093 -0.0661853 0.0000762 0.0002826 0.0000453 -0.09896 0.5932912 -0.6970616 -0.0000881 -0.6252875 0.2979846 0.0001294 -0.0003507 0.0002652 -0.0884223 -0.2377928 0.0694773 -0.0000505 0.0750226 0.1344758 -0.0000631 0.0000448 -0.0001359 -0.1428235 0.012644 0.1043307 -0.0000418 0.0752593 -0.0351603 -0.0000681 -0.000019 -0.0000371 -0.0625901 0.1056016 0.0563798 0.0000798 0.0196411 0.1150854 -0.0000221 0.00006 0.0000686 0.1766691 0.0665336 -0.0204466 -0.0000006 -0.0289936 -0.0551591 0.0000177 -0.0001009 0.000041 0.1662147 -0.000204 -0.0300392 0.0000524 -0.0219749 0.1059351 0.0000118 0.0001269 0.0000352 0.16422 unknown
polarizability: 126.3436508|-7.9057173|107.602546|0.0115739|-0.0006484|32.9987467 unknown
InChI: InChI=1S/C6H3ClFNO2/c7-4-2-1-3-5(6(4)8)9(10)11/h1-3H
charge 0 multiplicity 1
14 atoms
Cl -3.097005 1.412764 0.000346
F  -0.202541 2.050292 -0.000574
O  2.957509 -0.790313 0.001967
O  2.366398 1.408858 0.001131
N  2.077852 0.156492 -0.001371
C  0.647368 -0.256091 -0.000786
C  -0.414714 0.681721 -0.000455
C  0.369889 -1.642517 -0.000513
C  -1.746505 0.213898 0.000006
C  -0.961811 -2.091848 -0.000043
C  -2.028445 -1.16383 0.000215
H  1.218429 -2.331222 -0.000733
H  -1.177578 -3.163653 0.000121
H  -3.068946 -1.499552 0.000589
