program: Gaussian 09
title: 000075012
version: EM64L-G09RevD.01
frameworkgroup: C1[X(C6H2F3NO2)]
method: RPBEPBE
basis: SDD
operation: Freq
keyword: #p
keyword: freq=noraman
keyword: PBEPBE/SDD
title: #p freq=noraman PBEPBE/SDD
converged: YES YES YES YES
title: Mulliken charges:
elementType: F F F O O N C C C C C C H H
charge: -0.138637 -0.160018 -0.149839 -0.196750 -0.165329 0.031148 0.280439 0.274208 -0.438127 0.235102 -0.427009 0.225117 0.326100 0.303595
chargesum: 0.00000
title: Mulliken charges with hydrogens summed into heavy atoms:
elementType: F F F O O N C C C C C C
charge: -0.138637 -0.160018 -0.149839 -0.196750 -0.165329 0.031148 0.280439 0.274208 -0.112027 0.235102 -0.123414 0.225117
polarizability: 1.18522767e+02 2.27943225e+00 9.49239337e+01 -9.79028879e-04 4.51348232e-03 3.10590039e+01
1716.lowfreq: 0.0008 0.0012 0.0014 6.1164 8.3605 8.6021 16.8429 89.5278 164.9578
frequency: 16.8077 89.5269 164.9575 200.4966 243.0682 264.9140 303.6800 341.5370 383.3394 399.8832 448.3606 450.0956 581.4490 606.2030 621.0060 679.5425 705.1000 712.2893 742.4141 809.3412 842.3783 907.6549 1020.3452 1121.7358 1152.5519 1197.3932 1208.5154 1286.3355 1358.1655 1390.2518 1418.6647 1490.9853 1594.4869 1622.7470 3188.0121 3194.1147
redmass: 15.6018 15.0771 11.9518 14.2061 7.2536 18.0798 16.6973 14.3839 12.2235 12.8112 3.2588 15.0690 8.1396 8.6361 6.4448 3.8296 9.0049 8.6428 10.3681 5.0507 1.5678 1.3714 5.8883 2.4935 3.6995 6.8130 1.4128 7.8591 12.3594 10.0956 11.3769 4.3828 10.6557 8.2880 1.0922 1.0936
irintensity: 0.0270 0.8465 5.7426 2.1812 0.0262 0.6530 3.0529 0.7784 0.0875 0.0909 4.7274 0.0858 10.2270 3.9367 6.7365 0.2219 11.2682 5.5366 45.3115 31.3797 22.9542 50.0276 41.5535 14.1238 84.1731 252.4192 20.7326 84.9394 27.3968 15.3692 66.8942 262.7085 74.4936 33.8435 22.2376 2.4129
temp: 298.150 k
press: 1.00000 atm
elementType: 9 9 9 8 8 7 6 6 6 6 6 6 1 1
symmnumber: 1
zpe: 195938.4 jmol-1
zpe.correction: 0.074629 hartree
zpe.thermalcorrener: 0.084478 hartree
zpe.thermalcorrenthalpy: 0.085422 hartree
zpe.thermalcorrgfe: 0.037623 hartree
zpe.sumelectzpe: -733.593368 hartree
zpe.sumelectthermal: -733.583519 hartree
zpe.sumelectthermalent: -733.582575 hartree
zpe.sumelectthermalfe: -733.630374 hartree
dipole: 2.7443 1.1205 0.0001
dipole: 2.9642
quadrupole: -85.2268 -66.1986 -63.8899
quadrupole: 2.4502 0.0001 -0.0011
quadrupole: -13.4550 5.5731 7.8818 2.4502 0.0001 -0.0011
hfenergy: -733.6679969 hartree
pointgroup: C01 [X(C6H2F3N1O2)]
dipole: 1.080221 -0.4395482 -0.0000473 debye
dipolederiv: -0.3827235 -0.3459562 0.0000049 -0.2988142 -0.6735564 -0.0000049 0.0000077 0.0000015 -0.0994906 -0.609543 -0.3823866 -0.0000097 -0.496216 -0.5704743 -0.0000108 -0.0000132 -0.0000117 -0.1107562 -1.0918355 0.1990577 0.0000011 0.2378936 -0.2225539 -0.0000006 -0.0000063 -0.0000002 -0.1092896 -0.5655666 0.1581918 0.0000084 0.1441088 -0.7720677 -0.0001026 0.0000057 -0.0001251 -0.2237006 -0.7226634 -0.1532165 -0.0000787 -0.1180507 -0.481764 -0.0001026 -0.0000215 -0.0000698 -0.1992451 1.6846573 -0.2455671 0.000065 -0.2099209 1.1621133 0.0002436 0.0000495 0.0002032 0.2047479 -0.6719235 0.2892482 0.0000045 0.1113428 -0.1498533 -0.0000348 -0.0000221 -0.0000121 0.0308417 0.655206 0.4025735 -0.0000036 0.1025487 0.8364648 -0.0000025 -0.0000484 0.0000087 0.1284468 0.1118085 -0.2437613 -0.0000099 0.1857495 -0.1390444 -0.0000009 0.0000313 -0.0000052 -0.0819504 0.4462101 0.6215876 0.000017 0.8895689 0.5114396 0.0000115 0.0000258 0.0000171 0.0800938 -0.4256317 -0.1567431 -0.0000014 -0.0981545 -0.1146965 0.0000007 0.0000007 -0.0000005 -0.1406258 1.3080914 -0.1764888 0.0000009 -0.4372892 0.4098732 0.0000035 0.0000019 0.0000006 0.1158734 0.1661768 0.0249108 0.0000012 -0.0267513 0.1277426 0.0000017 -0.0000139 -0.000007 0.1976518 0.097737 0.00855 0.0000001 0.0139846 0.0763772 -0.0000013 0.0000027 0.0000006 0.2074029 unknown
polarizability: 118.5281591|-2.251341|94.9185416|0.0009737|0.0045146|31.0590039 unknown
InChI: InChI=1S/C6H2F3NO2/c7-3-1-5(9)6(10(11)12)2-4(3)8/h1-2H
charge 0 multiplicity 1
14 atoms
F  -1.279608 -2.242956 -0.000035
F  2.480375 1.883943 0.000056
F  3.282542 -0.781439 0.000004
O  -2.479266 1.851805 0.000287
O  -3.1381 -0.332601 -0.000216
N  -2.23458 0.582562 -0.000026
C  -0.807802 0.17271 -0.000008
C  -0.385615 -1.182647 -0.000029
C  0.161238 1.204033 0.000029
C  1.518447 0.878032 0.000029
C  0.983088 -1.509328 -0.000021
C  1.92854 -0.475656 0.000002
H  -0.17129 2.245393 0.000059
H  1.29963 -2.555351 -0.00003
