program: Gaussian 09
title: 000075021
version: EM64L-G09RevD.01
frameworkgroup: C1[X(C7H5I3O)]
method: RPBEPBE
basis: SDD
operation: Freq
keyword: #pfreq=noraman
keyword: PBEPBE/SDD
title: #p freq=noraman PBEPBE/SDD
converged: YES YES NO NO
title: Mulliken charges:
elementType: I I I O C C C C C C C H H H H H
charge: 0.130627 0.112405 0.164618 -0.386572 0.611439 -0.629643 -0.569738 0.595531 -0.079339 -0.804523 -0.525394 0.276162 0.259491 0.260299 0.240232 0.344406
chargesum: 0.00000
title: Mulliken charges with hydrogens summed into heavy atoms:
elementType: I I I O C C C C C C C
charge: 0.130627 0.112405 0.164618 -0.042166 0.611439 -0.629643 -0.569738 0.595531 0.196823 -0.044500 -0.525394
polarizability: 2.08005747e+02 1.38722177e+00 2.05846683e+02 4.95952320e-03 2.15657439e-03 4.60372879e+01
1716.lowfreq: -6.7120 -2.9638 0.0002 0.0003 0.0004 1.6976 55.7765 72.4847 84.7700
frequency: 55.7437 72.4806 84.7646 99.3592 116.9755 120.2941 160.5481 242.8845 252.1111 265.3516 272.5951 327.1028 374.1447 441.3429 497.6316 544.8612 589.9214 603.5379 608.0505 726.1843 734.5194 884.0339 945.7672 1002.7268 1024.7411 1036.6124 1142.2740 1212.5182 1285.1425 1335.3588 1348.1996 1398.1849 1422.5235 1464.1273 1467.4503 1544.2133 1550.9173 2986.2952 3063.0684 3112.4980 3181.7560 3430.5170
redmass: 3.2832 9.7404 61.8055 57.6028 2.2555 1.5622 118.3142 7.4848 8.8331 4.8668 5.4498 7.5264 3.5912 1.1011 4.5342 4.1541 8.6373 5.6549 8.2647 6.6048 7.2627 1.3958 2.8119 6.0607 2.2387 1.4942 1.6721 2.1137 1.9724 6.8664 7.4603 1.3325 2.6043 1.1598 1.0437 6.2648 9.3616 1.0389 1.0975 1.0969 1.0932 1.0647
irintensity: 0.0718 0.5638 0.0721 0.0788 1.8994 0.0729 0.0577 4.2868 0.6187 1.3366 1.3267 1.0214 3.7483 135.8849 1.8790 7.5974 52.2786 0.3695 26.2426 14.4418 25.0806 10.9471 14.8991 4.6057 33.0776 7.0018 231.2411 2.2868 46.8594 45.0262 116.5974 32.9805 53.1530 43.2894 15.3309 14.5135 6.2056 11.8700 9.7146 7.0477 0.1361 77.1683
temp: 298.150 k
press: 1.00000 atm
elementType: 53 53 53 8 6 6 6 6 6 6 6 1 1 1 1 1
symmnumber: 1
zpe: 257372.5 jmol-1
zpe.correction: 0.098028 hartree
zpe.thermalcorrener: 0.110298 hartree
zpe.thermalcorrenthalpy: 0.111242 hartree
zpe.thermalcorrgfe: 0.054870 hartree
zpe.sumelectzpe: -378.680599 hartree
zpe.sumelectthermal: -378.668329 hartree
zpe.sumelectthermalent: -378.667385 hartree
zpe.sumelectthermalfe: -378.723757 hartree
dipole: -0.0735 -2.3621 0.0016
dipole: 2.3632
quadrupole: -104.2940 -99.8623 -111.8840
quadrupole: -4.1349 0.0005 0.0052
quadrupole: 1.0527 5.4845 -6.5373 -4.1349 0.0005 0.0052
hfenergy: -378.7786269 hartree
pointgroup: C01 [X(C7H5I3O1)]
dipole: -0.5414965 0.7557572 -0.0071546 debye
dipolederiv: -0.0756339 0.0184647 -0.000021 0.0387803 -0.5432851 0.00741 0.0002968 0.0081799 0.0393802 -0.3463016 -0.2239697 0.0046332 -0.2564548 -0.1965409 0.0040693 0.004771 0.0031378 0.011158 -0.3581325 0.1834171 0.0000445 0.2452804 -0.079238 0.000168 -0.00085 0.0003389 0.0475213 -0.9341206 -0.5821075 0.0108884 -0.4672324 -0.5673131 0.0054401 0.0095012 0.0061491 -0.3751583 -0.095513 -0.1805509 0.0032522 -0.3791136 -0.2550061 0.0071468 0.0070366 0.0046248 0.1110984 -0.1589826 -0.1314795 0.0016511 0.1126035 1.0514324 -0.0192297 -0.0019391 -0.0177915 -0.2349512 0.6026393 0.5740554 -0.0100164 0.6724065 0.3028361 -0.0095594 -0.0107993 -0.0082323 -0.2120166 0.4848604 0.6981989 -0.0108461 0.6597821 -0.0318675 -0.0009946 -0.0104967 -0.0012868 0.1800641 -0.3795041 -0.0875996 0.0028641 -0.0052315 -0.1952243 0.002099 0.0013357 0.0025543 -0.0027395 -0.0865239 0.0636686 0.0001193 0.1382942 -0.0937328 0.0008943 -0.0040061 0.0026178 0.0498502 0.7067625 -0.3895653 -0.000673 -0.7193124 0.2230953 -0.0008891 0.004037 -0.0027308 -0.2053898 0.1125117 0.0032887 0.0002377 0.0114214 -0.0034563 0.0018302 0.0000372 0.0017546 0.1546693 0.0579475 0.0198417 -0.0234843 0.0459166 0.0223874 -0.0928824 0.012152 -0.0980053 -0.0136018 0.0564513 0.0252007 0.0189728 0.048554 0.0323196 0.0885258 -0.0159606 0.0952593 -0.0238173 -0.0173371 -0.0564416 0.0034753 -0.1441113 0.0715708 0.004844 0.0051895 0.0025014 0.1186208 0.4308764 0.0655784 -0.0010979 -0.0015829 0.2620226 0.0011276 -0.0003054 0.0009288 0.3553123 unknown
polarizability: 208.6141686|0.4598555|205.2071214|-0.9373468|-2.0265608|46.0684271 unknown
InChI: InChI=1S/C7H5I3O/c1-3-4(8)2-5(9)7(11)6(3)10/h2,11H,1H3
charge 0 multiplicity 1
16 atoms
I  -0.031949 3.298594 -0.04257
I  -2.943665 -2.255295 0.04459
I  3.128776 -1.949358 0.007156
O  2.437138 1.155278 -0.028594
C  -1.285143 0.429785 0.00557
C  -0.045322 1.128905 -0.011701
C  -1.189965 -0.990388 0.021766
C  1.224118 0.487422 -0.012013
C  0.052654 -1.664386 0.022061
C  -2.598958 1.180724 0.005372
C  1.251335 -0.930972 0.005862
H  0.087322 -2.75559 0.034597
H  -2.667126 1.855991 0.87814
H  -2.693953 1.808716 -0.899841
H  -3.458428 0.494889 0.036188
H  2.299266 2.142684 -0.040684
