program: Gaussian 09
title: 000070046
version: EM64L-G09RevD.01
frameworkgroup: C1[X(C11H7FO5S)]
method: RPBEPBE
basis: SDD
operation: Freq
keyword: #p
keyword: freq=noraman
keyword: PBEPBE/SDD
title: #p freq=noraman PBEPBE/SDD
converged: YES YES NO NO
title: Mulliken charges:
elementType: S F O O O O O C C C C C C C C C C C H H H H H H H
charge: 1.056498 -0.340780 -0.338293 -0.472725 -0.472707 -0.452491 -0.203121 0.627874 0.308287 -0.411661 -0.085527 0.165248 -0.339937 -0.383057 -0.346711 -0.240775 -0.266918 0.112027 0.341745 0.294546 0.190685 0.248291 0.245751 0.368947 0.394804
chargesum: 0.00000
title: Mulliken charges with hydrogens summed into heavy atoms:
elementType: S F O O O O O C C C C C C C C C C C
charge: 1.056498 -0.340780 0.030653 -0.472725 -0.472707 -0.057687 -0.203121 0.627874 0.308287 -0.411661 -0.085527 0.165248 0.001808 -0.088511 -0.156026 0.007516 -0.021167 0.112027
polarizability: 2.19508445e+02 -1.41564677e+01 2.23012616e+02 4.88910195e+00 1.17517386e+00 7.47922191e+01
1716.lowfreq: -6.3056 -2.4696 -0.0023 -0.0017 0.0018 5.8277 31.5565 38.9783 54.8353
frequency: 31.5551 38.9663 54.8302 83.4290 104.9262 119.5594 159.4238 188.5287 208.8989 220.3043 233.2447 274.0708 304.8293 316.0880 341.8417 347.7921 379.3185 387.1543 421.9539 431.8092 476.8273 479.1210 534.1749 559.0295 584.7040 586.0082 590.0193 631.5116 655.4262 708.1305 713.3717 746.3160 759.0757 812.3728 843.7852 853.2812 877.6361 890.6683 952.7102 955.6817 988.7356 998.5691 1013.6870 1046.6729 1092.7411 1137.5491 1172.3631 1195.1874 1205.1121 1269.3417 1288.8157 1304.8589 1339.3017 1392.3519 1419.5908 1442.3463 1454.4268 1508.9924 1576.5997 1597.7873 1626.1902 1655.1757 3097.6652 3151.3874 3168.6154 3175.0960 3183.4659 3541.0550 3554.4788
redmass: 12.4357 14.0500 6.4882 6.2673 4.0455 9.1704 9.4780 9.3676 11.2605 4.8099 11.0603 12.2652 12.5176 8.2748 4.8217 1.6522 7.7851 8.3880 9.1960 2.3065 7.1672 3.1079 13.4565 5.7435 1.8670 2.9943 2.8329 6.4700 3.8541 7.0590 6.1996 4.4848 1.4943 2.2941 8.9675 8.2684 2.4008 5.8477 1.4028 1.4358 10.8538 1.4171 3.9501 2.2557 3.0612 1.5018 1.6513 1.2620 1.8685 1.7835 2.0584 2.1333 3.9171 3.5249 3.9931 2.6771 3.9621 3.3770 7.5002 6.5506 6.3606 9.2076 1.0887 1.0889 1.0947 1.0922 1.0988 1.0645 1.0653
irintensity: 2.1944 0.2696 0.1836 0.5303 1.6106 3.2736 4.2640 1.0241 0.9281 0.2654 1.3020 8.5998 6.1183 5.3043 19.4111 47.5254 2.5110 2.3011 70.4237 71.8178 3.7966 1.4276 139.4255 34.9860 95.9178 66.8843 43.0671 10.9028 16.4059 9.2944 22.9347 32.1109 89.4828 0.7102 18.6098 112.0375 9.0450 23.0214 1.0461 14.1767 32.0264 0.8289 291.9532 35.1754 99.2486 209.1808 16.0530 1.6286 22.9183 36.3739 39.5559 53.2361 94.3133 0.9974 6.0840 13.2031 10.0714 70.8875 17.6795 50.5500 100.8322 276.5303 13.8371 6.8393 10.2871 24.3256 6.7136 65.8741 45.5647
temp: 298.150 k
press: 1.00000 atm
elementType: 16 9 8 8 8 8 8 6 6 6 6 6 6 6 6 6 6 6 1 1 1 1 1 1 1
symmnumber: 1
zpe: 421423.7 jmol-1
zpe.correction: 0.160512 hartree
zpe.thermalcorrener: 0.176891 hartree
zpe.thermalcorrenthalpy: 0.177835 hartree
zpe.thermalcorrgfe: 0.115581 hartree
zpe.sumelectzpe: -1295.955622 hartree
zpe.sumelectthermal: -1295.939243 hartree
zpe.sumelectthermalent: -1295.938298 hartree
zpe.sumelectthermalfe: -1296.000553 hartree
dipole: 2.8641 6.1679 -0.4833
dipole: 6.8176
quadrupole: -127.3559 -89.3402 -116.4664
quadrupole: -12.0501 -0.0244 0.7594
quadrupole: -16.3017 21.7140 -5.4122 -12.0501 -0.0244 0.7594
hfenergy: -1296.1161338 hartree
pointgroup: C01 [X(C11H7F1O5S1)]
dipole: -0.4754049 -2.6369697 -0.1218172 debye
dipolederiv: 1.5076662 0.5391646 0.0493962 0.4808472 1.7919351 -0.054654 0.1003751 0.0393729 1.5093632 -0.553628 -0.188851 -0.1939008 -0.0565128 -0.4253602 0.0835303 -0.3477892 -0.1592341 -0.7797818 -0.6485919 -0.6609029 0.0271695 -0.6683147 -0.8578878 0.025827 0.0228357 0.0204619 -0.3436734 -0.6042801 -0.1529717 0.1068709 -0.0935029 -0.5762639 -0.041305 0.114166 0.0314835 -0.4809036 -0.4499232 -0.0027843 0.0133707 -0.0929067 -0.7413034 0.0184576 0.0393665 0.0175606 -0.3926027 -0.447591 0.2527302 -0.0156651 0.4512785 -1.241882 0.0448383 -0.0317911 0.0466284 -0.4294977 -1.1772436 -0.1200858 0.0223577 -0.0323501 -0.5430345 0.01819 0.0121583 0.0155034 -0.3047568 -0.0172212 -0.5126383 0.017717 -0.0748206 0.2409784 -0.0127948 -0.0037145 -0.0184071 0.08353 -0.3957027 -0.1461591 0.0084364 -0.0202426 -0.0062397 -0.0001012 -0.0006865 -0.0020697 0.025107 -0.4718192 0.0178829 0.0151737 0.0722267 -0.2301445 -0.0252296 0.1464118 0.1108865 -0.2084311 0.8080399 0.4713094 -0.0226086 0.4117982 1.0572078 -0.0379871 -0.0179578 -0.0430331 0.1046768 -0.7738777 0.2963573 -0.0069494 -0.0583735 -0.587244 0.0234092 0.0135501 0.0287807 -0.0262068 0.5164248 0.2378543 -0.0114919 0.1137024 -0.1898897 0.0109131 -0.0817539 -0.0479269 -0.0314932 -0.0561099 0.2434904 -0.007189 0.1767271 -0.1316579 0.0086495 -0.0157635 0.0271299 -0.0949578 -0.0023703 0.1286914 -0.0070486 -0.0084478 -0.0412034 -0.0053694 0.0008353 -0.0047427 -0.1515359 0.2071473 0.0011466 0.0003974 -0.0421319 0.0723023 -0.0111458 0.0082148 -0.0091665 -0.1181266 -0.1311279 -0.0911146 0.0044826 -0.0351837 0.1398785 -0.0119286 -0.0015912 -0.0172574 -0.1335778 1.9454561 -0.388472 -0.0075043 -0.4985157 1.4548886 -0.0723117 0.0131819 -0.0529058 0.2462366 0.216745 -0.0173137 0.000003 -0.002484 0.1365285 0.0040483 0.0074315 0.0020047 0.1576521 0.0860899 -0.0162003 0.003873 -0.0641081 0.0713855 0.0057104 0.0088805 -0.0162521 0.1350339 -0.0552056 -0.1459227 0.0070387 -0.0821048 0.0025468 0.0068296 0.0078868 0.0119063 0.1537052 -0.0621533 0.0553994 -0.0030595 0.0415923 0.0766079 0.0045015 -0.0015925 0.0057215 0.1566091 0.0852955 0.0386729 -0.0019543 0.0486369 -0.084967 0.0107762 -0.002271 0.0106243 0.1625439 0.3375722 0.1937791 -0.0062814 0.1608796 0.2432743 0.0033108 -0.0051515 0.0032193 0.3594097 0.1364086 -0.033062 0.007366 -0.1276891 0.3695444 0.0038353 0.0147683 -0.0002884 0.4016775 unknown
polarizability: 226.7088766|-13.277464|215.6257096|-3.11526|-6.2722644|74.9786942 unknown
InChI: InChI=1S/C11H7FO5S/c12-18(16,17)9-5-8(11(14)15)10(13)7-4-2-1-3-6(7)9/h1-5,13-14H
charge 0 multiplicity 1
25 atoms
S  1.800777 2.226413 -0.19658
F  2.583968 1.970477 1.481677
O  -2.443918 -2.06395 0.053125
O  3.000159 1.948928 -1.232465
O  1.038931 3.639843 -0.16259
O  -3.289075 2.091278 -0.127118
O  -4.247731 -0.018014 0.014135
C  1.008853 -0.534027 -0.040451
C  -0.034619 -1.537699 0.012123
C  0.567744 0.828656 -0.09955
C  -1.429979 -1.130384 0.007817
C  -1.794928 0.236958 -0.041883
C  -0.759461 1.219547 -0.090122
C  2.378682 -0.945349 -0.018428
C  0.345513 -2.916715 0.073575
C  2.709521 -2.301077 0.042707
C  1.689292 -3.295976 0.08751
C  -3.215905 0.684515 -0.044924
H  -1.043122 2.275047 -0.121824
H  3.171548 -0.194627 -0.059274
H  -0.407777 -3.715058 0.113875
H  3.761573 -2.602536 0.058662
H  1.960163 -4.355105 0.135253
H  -2.100701 -2.99268 0.085685
H  -4.246008 2.360235 -0.122335
