program: Gaussian 09
title: 000070040
version: EM64L-G09RevD.01
frameworkgroup: C1[X(C15H16O)]
method: RPBEPBE
basis: SDD
operation: Freq
keyword: #pfreq=noraman
keyword: PBEPBE/SDD
title: #p freq=noraman PBEPBE/SDD
converged: YES YES NO NO
title: Mulliken charges:
elementType: O C C C C C C C C C C C C C C C H H H H H H H H H H H H H H H H
charge: -0.437755 -0.592464 -0.591841 0.411370 0.248397 0.521994 -0.407576 -0.405378 -0.502769 -0.439874 -0.380772 -0.238266 -0.241939 -0.223431 -0.236172 -0.244537 0.223210 0.273280 0.222559 0.214392 0.238022 0.230502 0.205746 0.217301 0.230305 0.236570 0.227302 0.229034 0.222598 0.223854 0.226485 0.339853
chargesum: 0.00000
title: Mulliken charges with hydrogens summed into heavy atoms:
elementType: O C C C C C C C C C C C C C C C
charge: -0.097902 -0.095974 -0.154889 0.411370 0.248397 0.521994 -0.169554 -0.174876 -0.079722 -0.209569 -0.144202 -0.010964 -0.012905 -0.000832 -0.012318 -0.018052
polarizability: 2.23291691e+02 -9.02241147e+00 1.67957196e+02 -1.67707862e+01 -6.49455280e+00 8.90013807e+01
1716.lowfreq: -9.9089 -5.4633 -0.0009 -0.0007 -0.0005 3.3533 17.8275 28.9483 50.1149
frequency: 17.7524 28.8283 50.1131 79.0600 89.8883 111.2782 141.8425 219.3695 258.2710 287.3958 326.1083 331.8083 371.6420 401.7072 403.6137 454.7564 490.9695 528.1651 545.8253 596.6211 614.4026 618.2146 703.8743 718.4017 752.0386 763.8611 769.1468 788.6592 820.0120 849.6308 853.0297 881.1373 916.6065 930.0700 950.7703 961.3489 974.4654 986.5972 989.4612 991.3311 992.0126 1001.9613 1026.6263 1044.2863 1073.1620 1104.2641 1144.8501 1161.9621 1171.3867 1174.8096 1186.6944 1193.0625 1214.5556 1229.6376 1266.2780 1273.3792 1288.3403 1312.5932 1322.0281 1333.9715 1369.4746 1381.6758 1383.6482 1438.5062 1439.6877 1468.6774 1478.9359 1483.5604 1487.3732 1498.1225 1586.9121 1592.6515 1610.8203 1613.8530 2972.9745 2983.6378 3002.1753 3035.9957 3066.1675 3071.2668 3109.6153 3112.6876 3114.0510 3115.4342 3130.0955 3136.9483 3142.0024 3159.6980 3160.8755 3557.9467
redmass: 4.0936 4.4557 4.2178 4.1908 3.0862 4.6611 3.6955 4.2848 2.9818 1.9193 2.1525 2.2060 2.4731 2.4619 2.6836 3.2040 3.6699 4.1350 4.1212 4.4888 5.1381 6.0213 1.8885 3.4119 1.6673 1.6503 2.6728 1.3239 3.2831 2.8936 1.2860 1.4656 1.4919 3.8548 1.6160 1.7421 1.3920 1.9383 2.1228 2.1996 1.4029 3.3425 2.1833 2.1397 1.6355 1.6242 1.1364 1.1471 1.0517 1.0586 1.1136 2.6947 2.4688 2.3888 1.3279 1.3460 1.3398 1.2368 1.3328 1.2986 1.2380 7.4357 5.5692 2.2810 2.1781 1.1264 1.7841 2.3295 1.3276 1.0971 6.5615 6.0290 6.3937 6.1624 1.0679 1.0600 1.0614 1.1001 1.0974 1.1007 1.0875 1.0872 1.0869 1.0887 1.0906 1.0923 1.0957 1.1004 1.1014 1.0664
irintensity: 0.2003 0.1603 1.3682 1.8196 0.8448 0.1334 0.6162 0.7129 1.8500 39.3520 49.8159 29.9786 30.6852 21.9886 7.4864 4.7081 11.5163 20.6763 6.9893 12.7326 0.9275 0.2161 41.5047 18.6415 2.9046 100.4773 20.6411 1.5395 0.1227 3.1706 0.1230 2.5773 2.9678 75.3045 3.2525 0.5679 0.0131 1.4119 0.0560 1.0512 0.4712 0.6076 8.1320 7.2423 4.6399 7.3431 9.9568 14.7740 0.4467 0.3497 0.1261 6.3688 0.0884 7.3166 3.4347 10.8629 7.3431 6.7389 2.3125 0.6805 27.2429 0.0309 0.6264 6.8387 4.9135 6.9717 4.3729 39.5710 9.7180 8.1740 2.6040 1.5468 7.2808 12.0378 69.5127 18.5666 35.8386 11.9353 18.2058 20.6041 16.9265 10.5281 7.8156 3.2828 11.1273 24.7724 45.1723 37.2132 23.6511 5.6033
temp: 298.150 k
press: 1.00000 atm
elementType: 8 6 6 6 6 6 6 6 6 6 6 6 6 6 6 6 1 1 1 1 1 1 1 1 1 1 1 1 1 1 1 1
symmnumber: 1
zpe: 698555.8 jmol-1
zpe.correction: 0.266066 hartree
zpe.thermalcorrener: 0.280583 hartree
zpe.thermalcorrenthalpy: 0.281527 hartree
zpe.thermalcorrgfe: 0.222171 hartree
zpe.sumelectzpe: -655.261176 hartree
zpe.sumelectthermal: -655.246659 hartree
zpe.sumelectthermalent: -655.245715 hartree
zpe.sumelectthermalfe: -655.305071 hartree
dipole: 1.6782 -0.8837 -0.1409
dipole: 1.9019
quadrupole: -82.4152 -90.1914 -98.7133
quadrupole: 2.4129 -1.7660 -2.4041
quadrupole: 8.0248 0.2486 -8.2734 2.4129 -1.7660 -2.4041
hfenergy: -655.5272421 hartree
pointgroup: C01 [X(C15H16O1)]
dipole: -0.6606445 0.3457205 -0.0625111 debye
polarizability: 222.8023025|-9.0885312|167.7578633|18.7599284|7.1685342|89.6901018 unknown
InChI: InChI=1S/C15H16O/c16-12-15-9-5-4-8-14(15)11-10-13-6-2-1-3-7-13/h1-9,16H,10-12H2
charge 0 multiplicity 1
32 atoms
O  -1.515973 -2.771855 0.710883
C  -0.201027 0.190136 0.600641
C  0.705587 0.502091 -0.636453
C  -1.679572 0.384576 0.297171
C  -2.476463 -0.66436 -0.258162
C  2.18279 0.296922 -0.333049
C  -2.288595 1.642183 0.53596
C  -3.840618 -0.421096 -0.558426
C  -1.90193 -2.047146 -0.523723
C  3.059295 1.401326 -0.182137
C  2.710333 -1.011311 -0.167124
C  -3.64908 1.876594 0.233441
C  -4.432804 0.839095 -0.31892
C  4.426242 1.208473 0.125465
C  4.074591 -1.209498 0.138144
C  4.939024 -0.098843 0.286274
H  0.104532 0.858222 1.427772
H  -0.01145 -0.84499 0.934095
H  0.520785 1.543487 -0.960731
H  0.394686 -0.15047 -1.476098
H  -1.683173 2.448567 0.968867
H  -4.44487 -1.231798 -0.986178
H  -2.627571 -2.6487 -1.108763
H  -0.958641 -1.999738 -1.093112
H  2.668045 2.418578 -0.310227
H  2.047214 -1.87899 -0.278701
H  -4.093664 2.858745 0.430283
H  -5.488652 1.007717 -0.557612
H  5.088921 2.074638 0.235825
H  4.46456 -2.22669 0.259418
H  5.998228 -0.251679 0.522286
H  -2.293352 -2.776488 1.325591
