program: Gaussian 09
title: 000070038
version: EM64L-G09RevD.01
frameworkgroup: C1[X(C13H10O3)]
method: RPBEPBE
basis: SDD
operation: Freq
keyword: #pfreq=noraman
keyword: PBEPBE/SDD
title: #p freq=noraman PBEPBE/SDD
converged: YES YES NO NO
title: Mulliken charges:
elementType: O O O C C C C C C C C C C C C C H H H H H H H H H H
charge: -0.400256 -0.423192 -0.196720 0.264697 0.172614 0.038532 0.157791 0.182781 -0.325817 -0.333210 -0.405485 -0.391770 -0.265701 -0.256914 -0.204457 -0.201352 0.245400 0.272402 0.217242 0.218213 0.229580 0.233935 0.227804 0.230734 0.355263 0.357883
chargesum: 0.00000
title: Mulliken charges with hydrogens summed into heavy atoms:
elementType: O O O C C C C C C C C C C C C C
charge: -0.044992 -0.065308 -0.196720 0.264697 0.172614 0.038532 0.157791 0.182781 -0.080417 -0.060807 -0.188242 -0.173557 -0.036121 -0.022979 0.023347 0.029382
polarizability: 2.10455477e+02 -3.31971883e+00 1.41846367e+02 1.45884559e+01 -1.38239402e+00 9.85064072e+01
1716.lowfreq: -9.0246 -5.7540 -0.0005 0.0002 0.0006 5.5613 29.4529 40.1846 68.2299
frequency: 29.3241 40.1740 68.2246 112.9224 157.6114 175.0376 214.0431 245.3224 264.5583 332.3191 340.8724 357.0259 381.7886 422.6832 433.0814 455.7623 510.9913 521.2638 536.4300 541.2941 584.8346 627.0594 667.2810 688.3309 739.5147 752.5353 756.7824 780.3673 796.8525 818.7325 844.3560 852.1002 914.0805 939.7697 951.6543 974.1374 983.9701 1038.1833 1041.9622 1068.8012 1082.4894 1152.0599 1154.5922 1157.3817 1172.5145 1173.2288 1240.4979 1249.1966 1266.6281 1292.8004 1298.1784 1388.6967 1392.3416 1426.8935 1431.8618 1482.2089 1489.7640 1549.7908 1594.3389 1599.8005 1607.0582 1609.4524 3111.1248 3111.5304 3132.0258 3140.6833 3144.0899 3152.6595 3166.9216 3171.2937 3569.8731 3570.8346
redmass: 6.0701 5.6885 5.0720 5.6303 5.6191 6.3584 6.2288 5.2175 4.6339 3.8415 1.2445 1.2560 3.8834 4.2773 3.8273 3.8093 3.8627 3.7833 6.6141 5.6918 5.1958 6.1865 4.6950 4.5122 3.7410 1.4504 1.3795 3.5077 4.3991 5.9510 1.5188 1.5707 5.2694 1.4451 1.3939 1.3262 1.3448 2.4384 2.1367 2.5570 1.9795 1.2990 1.5470 1.6493 1.0574 1.0754 2.8397 2.7136 2.8546 1.4448 1.6925 7.4472 7.4936 2.3464 2.4283 2.4805 2.5830 10.2924 6.4829 6.6111 6.5233 6.7495 1.0884 1.0887 1.0872 1.0880 1.0934 1.0930 1.1004 1.1002 1.0660 1.0660
irintensity: 3.9839 0.4800 2.8138 1.7459 0.0486 0.4084 0.2961 3.4255 5.2059 25.2635 97.5762 96.3256 12.7529 11.4567 18.2142 9.5255 11.9341 10.8476 1.5258 5.2144 1.5742 30.8650 10.7988 6.3304 4.9490 95.9208 76.1025 8.3199 19.9733 31.4637 0.3607 1.0641 78.6075 1.0387 4.0338 0.2041 2.1435 0.1224 3.8724 85.9356 118.6032 38.1391 81.1943 5.1332 8.8517 0.3100 39.6591 43.1233 111.4212 67.6947 155.0675 14.9113 10.1240 25.6312 78.6469 16.5624 20.6610 127.0567 24.6553 85.1406 74.4948 48.4532 15.3503 12.1277 1.0937 7.2916 24.7127 8.3204 23.4689 23.9044 33.0285 33.8657
temp: 298.150 k
press: 1.00000 atm
elementType: 8 8 8 6 6 6 6 6 6 6 6 6 6 6 6 6 1 1 1 1 1 1 1 1 1 1
symmnumber: 1
zpe: 508681.1 jmol-1
zpe.correction: 0.193746 hartree
zpe.thermalcorrener: 0.207394 hartree
zpe.thermalcorrenthalpy: 0.208339 hartree
zpe.thermalcorrgfe: 0.152574 hartree
zpe.sumelectzpe: -725.920174 hartree
zpe.sumelectthermal: -725.906526 hartree
zpe.sumelectthermalent: -725.905582 hartree
zpe.sumelectthermalfe: -725.961347 hartree
dipole: 0.0765 -4.6009 1.3402
dipole: 4.7927
quadrupole: -66.0236 -92.9147 -87.9443
quadrupole: 4.7225 4.4021 -1.9651
quadrupole: 16.2706 -10.6205 -5.6501 4.7225 4.4021 -1.9651
hfenergy: -726.1139208 hartree
pointgroup: C01 [X(C13H10O3)]
dipole: 0.1215538 -1.0338908 -1.5721884 debye
dipolederiv: -0.1023456 0.0832768 0.1142511 0.3187925 -1.304991 -0.0091224 0.1357409 -0.0380804 -0.3160282 -0.4852 -0.0468569 -0.6305345 -0.0506221 -0.3146984 0.0966366 -0.4353827 0.0760714 -0.842991 -0.8068439 -0.0362741 0.0467825 -0.1517584 -0.5827963 -0.3195143 0.1410122 -0.3265626 -0.6420132 -0.5858547 0.0317842 -0.1502013 -0.2698077 -0.3149548 -0.1642133 -0.1788422 -0.0470783 -0.1086193 -0.7905782 0.1054796 0.1732703 0.0961128 -0.1002771 -0.0785363 -0.1951335 -0.0440219 -0.2574059 2.0618022 0.0928596 -0.0539101 0.2209101 0.5707564 0.4639324 -0.0369523 0.4086788 0.5987031 0.2340231 -0.0146012 0.0422912 -0.4112673 1.2435596 -0.0014806 -0.0922075 0.0583713 0.0654625 0.5440595 -0.0111728 0.632617 -0.1601911 0.0960784 -0.0366117 0.2925502 -0.0093338 0.8242974 0.0669045 -0.0585306 0.0441642 0.2354376 0.1469029 0.1014397 0.2119728 0.0770247 -0.0193073 0.2896074 -0.0947142 -0.1110825 0.0521527 -0.0825362 0.0591956 0.2219722 0.00413 0.0678714 -0.0018989 -0.2911236 0.0498999 0.0558062 -0.3416449 0.0037445 0.0861217 -0.1093582 -0.1788549 -0.3109669 -0.0354289 -0.3396874 0.010791 -0.1859993 0.1067612 -0.0299152 0.0371717 -0.0500181 -0.4018896 -0.0131092 -0.0480774 0.0144234 0.0244266 0.0311647 -0.0735259 0.0182265 -0.2026366 -0.2202338 0.0272794 0.1967963 0.0465252 -0.2006878 -0.0273348 0.2256586 -0.0217831 -0.1237528 0.1687605 0.0065572 0.1092641 -0.1925543 0.1570023 -0.0179835 0.0720907 0.0337539 -0.0907826 0.0958133 -0.0499415 0.0606131 -0.071878 -0.0926669 0.0438286 -0.1056901 0.076183 0.223836 -0.01427 0.0944894 -0.0445071 0.1145436 0.0629544 0.0038377 -0.0504205 0.0018696 0.0979539 0.1226921 0.0230448 0.0579799 -0.0101634 0.1348428 -0.0483572 0.0235143 -0.0210348 0.0036138 -0.0516205 0.0841952 -0.0636479 0.1277019 -0.015219 0.0217148 -0.065976 0.0149711 0.1484754 0.0659313 0.0201315 0.001124 0.0409867 0.1522847 -0.0450262 0.0493318 -0.0555668 -0.1213135 0.0837699 0.013805 -0.0257859 -0.0167169 -0.1173753 -0.0354114 -0.0459237 -0.0346713 0.1488697 -0.0316141 0.0177161 -0.0972099 0.0185905 0.1639411 -0.0087462 -0.1109478 -0.0141372 -0.0179462 -0.0563326 -0.0843365 -0.080225 -0.0839027 0.0429244 -0.0416317 -0.0802995 -0.0444288 0.1209974 -0.1048007 0.0599358 0.0328419 0.068794 0.1363829 -0.0213917 0.043783 -0.0207704 0.0878957 0.0802688 0.0342604 -0.0909634 -0.0656066 0.395969 -0.0102906 -0.1129662 0.0159656 0.3309451 0.1508169 0.0412747 0.1739369 0.0629003 0.3258216 -0.0666039 0.1104345 -0.0355899 0.2527482 unknown
polarizability: 207.3384322|-8.403491|122.1148802|21.3815495|21.012518|121.3549389 unknown
InChI: InChI=1S/C13H10O3/c14-11-7-3-1-5-9(11)13(16)10-6-2-4-8-12(10)15/h1-8,14-15H
charge 0 multiplicity 1
26 atoms
O  -2.445156 2.05389 0.14252
O  0.777907 -0.051725 -1.75571
O  -0.229863 1.470184 1.912073
C  -1.254935 -0.045285 0.335398
C  1.321134 0.204133 0.594638
C  -0.076167 0.624591 0.980744
C  -2.445753 0.662263 0.002997
C  1.730655 -0.126713 -0.729294
C  -1.231174 -1.448993 0.133396
C  2.309575 0.211383 1.61516
C  -3.575629 -0.030462 -0.49739
C  3.077634 -0.473519 -1.002732
C  -2.355866 -2.147441 -0.351046
C  3.648503 -0.136686 1.354336
C  -3.533194 -1.430176 -0.665755
C  4.030041 -0.486163 0.036586
H  -0.314042 -1.996074 0.37929
H  1.988807 0.505732 2.620068
H  -4.485891 0.526789 -0.756171
H  3.380014 -0.721688 -2.028993
H  -2.317632 -3.233707 -0.480254
H  4.387221 -0.135565 2.161793
H  -4.416183 -1.955845 -1.045696
H  5.067761 -0.758493 -0.185193
H  -3.318097 2.432401 -0.13115
H  1.186032 -0.269229 -2.630818
