program: Orca
programVersion: 6.0.0
elementType: Cu Cu O H N C H C H C H C H C C C H N C N C H C H C N C C H C H C H C H N O O C C F F F O O C C F F F O O C C F F F Cu Cu O H N C H C H C H C H C C C H N C N C H C H C N C C H C H C H C H N O O C C F F F O O C C F F F O O C C F F F
charge: 0
multiplicity: 5
keywords: TPSS D3BJ Freq def2-TZVPP def2/J RIJCOSX TightSCF defgrid3 CPCM(Acetonitrile)
frequency: 0.00 0.00 0.00 0.00 0.00 0.00 -4.31 7.30 8.88 14.30 14.71 15.38 15.84 18.00 19.63 21.17 22.75 23.16 23.49 24.90 25.43 28.21 30.76 32.27 32.65 34.24 35.67 38.13 42.92 45.20 45.96 49.36 52.87 58.21 58.83 60.54 61.78 63.26 67.69 75.40 77.51 80.04 82.79 89.79 94.73 95.04 96.73 100.25 100.66 101.86 102.24 104.15 111.26 111.96 117.78 119.49 120.56 121.49 134.31 136.01 140.69 144.34 146.40 148.82 152.89 155.02 168.62 174.02 176.37 178.64 189.53 192.39 196.39 199.07 211.70 214.10 215.28 219.03 221.77 232.81 251.34 251.91 254.57 256.27 257.14 258.69 262.51 264.03 265.37 267.69 269.76 271.07 285.90 286.51 294.40 294.64 299.20 300.06 312.37 314.25 344.71 345.55 361.07 362.79 372.40 373.50 382.59 383.19 387.14 388.25 393.02 394.04 400.52 407.62 411.45 411.52 416.81 418.49 421.91 422.20 449.77 450.17 456.40 458.83 470.91 471.65 475.94 476.26 490.94 491.03 492.99 493.26 493.44 493.51 494.63 494.72 506.23 506.39 509.39 522.87 568.06 568.12 583.32 583.44 585.32 585.63 586.73 586.99 616.90 617.48 639.59 639.76 645.67 645.78 648.34 648.89 657.39 657.53 669.12 671.41 677.51 678.51 684.83 684.98 691.43 691.58 692.33 692.41 712.77 712.80 736.49 736.70 742.06 742.20 748.92 749.08 760.89 761.00 762.89 763.14 763.22 763.40 765.90 766.04 767.10 767.30 785.11 785.16 789.26 789.35 791.67 791.74 803.79 804.03 804.73 804.85 825.96 826.11 861.59 861.64 864.62 868.11 892.35 892.55 898.13 898.61 959.84 960.35 961.98 962.02 969.12 969.23 971.21 971.37 978.24 978.50 1011.35 1011.46 1016.54 1016.61 1018.16 1018.24 1020.73 1020.99 1023.74 1024.03 1042.50 1042.87 1043.72 1044.09 1058.19 1058.53 1061.44 1061.83 1077.82 1078.16 1084.95 1085.65 1087.51 1087.94 1090.85 1091.20 1104.51 1104.95 1129.43 1130.02 1132.71 1132.86 1142.54 1142.65 1142.81 1143.37 1146.58 1147.44 1148.61 1149.31 1166.24 1166.57 1169.61 1170.26 1232.13 1232.36 1254.54 1254.77 1287.06 1287.40 1295.83 1296.40 1301.51 1302.05 1305.25 1305.62 1326.06 1326.33 1339.98 1340.77 1347.32 1347.84 1354.17 1354.89 1359.65 1359.72 1367.10 1367.28 1378.20 1378.46 1431.24 1431.47 1459.86 1459.88 1464.48 1464.54 1472.77 1473.29 1480.18 1480.54 1528.35 1528.58 1548.28 1548.34 1563.99 1564.18 1579.49 1579.59 1580.35 1580.42 1608.44 1608.65 1616.46 1616.51 1628.52 1628.58 1637.13 1637.31 1660.78 1661.27 1663.37 1666.53 3165.33 3165.48 3169.55 3169.72 3179.27 3179.61 3183.11 3183.27 3184.40 3184.63 3189.37 3189.71 3206.20 3206.72 3206.94 3206.98 3207.15 3207.25 3218.40 3218.81 3258.04 3258.10 3679.59 3680.30
frequency: 7.30 8.88 14.30 14.71 15.38 15.84 18.00 19.63 21.17 22.75 23.16 23.49 24.90 25.43 28.21 30.76 32.27 32.65 34.24 35.67 38.13 42.92 45.20 45.96 49.36 52.87 58.21 58.83 60.54 61.78 63.26 67.69 75.40 77.51 80.04 82.79 89.79 94.73 95.04 96.73 100.25 100.66 101.86 102.24 104.15 111.26 111.96 117.78 119.49 120.56 121.49 134.31 136.01 140.69 144.34 146.40 148.82 152.89 155.02 168.62 174.02 176.37 178.64 189.53 192.39 196.39 199.07 211.70 214.10 215.28 219.03 221.77 232.81 251.34 251.91 254.57 256.27 257.14 258.69 262.51 264.03 265.37 267.69 269.76 271.07 285.90 286.51 294.40 294.64 299.20 300.06 312.37 314.25 344.71 345.55 361.07 362.79 372.40 373.50 382.59 383.19 387.14 388.25 393.02 394.04 400.52 407.62 411.45 411.52 416.81 418.49 421.91 422.20 449.77 450.17 456.40 458.83 470.91 471.65 475.94 476.26 490.94 491.03 492.99 493.26 493.44 493.51 494.63 494.72 506.23 506.39 509.39 522.87 568.06 568.12 583.32 583.44 585.32 585.63 586.73 586.99 616.90 617.48 639.59 639.76 645.67 645.78 648.34 648.89 657.39 657.53 669.12 671.41 677.51 678.51 684.83 684.98 691.43 691.58 692.33 692.41 712.77 712.80 736.49 736.70 742.06 742.20 748.92 749.08 760.89 761.00 762.89 763.14 763.22 763.40 765.90 766.04 767.10 767.30 785.11 785.16 789.26 789.35 791.67 791.74 803.79 804.03 804.73 804.85 825.96 826.11 861.59 861.64 864.62 868.11 892.35 892.55 898.13 898.61 959.84 960.35 961.98 962.02 969.12 969.23 971.21 971.37 978.24 978.50 1011.35 1011.46 1016.54 1016.61 1018.16 1018.24 1020.73 1020.99 1023.74 1024.03 1042.50 1042.87 1043.72 1044.09 1058.19 1058.53 1061.44 1061.83 1077.82 1078.16 1084.95 1085.65 1087.51 1087.94 1090.85 1091.20 1104.51 1104.95 1129.43 1130.02 1132.71 1132.86 1142.54 1142.65 1142.81 1143.37 1146.58 1147.44 1148.61 1149.31 1166.24 1166.57 1169.61 1170.26 1232.13 1232.36 1254.54 1254.77 1287.06 1287.40 1295.83 1296.40 1301.51 1302.05 1305.25 1305.62 1326.06 1326.33 1339.98 1340.77 1347.32 1347.84 1354.17 1354.89 1359.65 1359.72 1367.10 1367.28 1378.20 1378.46 1431.24 1431.47 1459.86 1459.88 1464.48 1464.54 1472.77 1473.29 1480.18 1480.54 1528.35 1528.58 1548.28 1548.34 1563.99 1564.18 1579.49 1579.59 1580.35 1580.42 1608.44 1608.65 1616.46 1616.51 1628.52 1628.58 1637.13 1637.31 1660.78 1661.27 1663.37 1666.53 3165.33 3165.48 3169.55 3169.72 3179.27 3179.61 3183.11 3183.27 3184.40 3184.63 3189.37 3189.71 3206.20 3206.72 3206.94 3206.98 3207.15 3207.25 3218.40 3218.81 3258.04 3258.10 3679.59 3680.30
formula: C44H24Cu4F18N10O14
InChI: InChI=1/2C16H11N5.6C2F3O2.4Cu.2HO/c2*1-3-8-17-12(5-1)14-7-10-21-11-15(20-16(21)19-14)13-6-2-4-9-18-13;6*3-2(4,5)1(6)7;;;;;;/h2*1-11H;;;;;;;;;;;2*1H/q2*-4;;;4*-1;4*+3;;/r2C20H12Cu2F6N5O5.2C2F3O2/c2*23-19(24,25)16(34)36-21-30-8-3-1-5-12(30)14-7-10-29-11-15-13-6-2-4-9-31(13)22(38-21,33(15)18(29)32(14)21)37-17(35)20(26,27)28;2*3-2(4,5)1(6)7/h2*1-11,38H;;
114 atoms
Cu 8.99974 8.777583 10.985029
Cu 9.315304 8.861513 7.512402
O  8.336947 9.103707 9.175122
H  8.00556 10.017317 9.142459
N  9.523306 7.98669 12.78726
C  9.218077 8.499052 13.9869
H  8.721217 9.459162 13.983488
C  9.519354 7.83746 15.173206
H  9.248072 8.288719 16.119987
C  10.163198 6.60358 15.113021
H  10.410271 6.064293 16.020675
C  10.476772 6.061766 13.870975
H  10.963366 5.09732 13.785455
C  10.136937 6.774484 12.723318
C  10.363649 6.30888 11.365526
C  10.944881 5.179041 10.825742
H  11.40937 4.313382 11.268652
N  10.838999 5.331246 9.459705
C  10.185486 6.548598 9.217413
N  9.902169 7.132921 10.36825
C  11.243311 4.556339 8.408336
H  11.744631 3.627301 8.644718
C  10.993389 5.000156 7.140043
H  11.314307 4.399876 6.300606
C  10.340022 6.241606 6.945759
N  9.947312 6.989148 7.982297
C  10.067019 6.834735 5.633835
C  10.235265 6.160032 4.426224
H  10.584763 5.135228 4.416902
C  9.934516 6.819318 3.237181
H  10.05321 6.3105 2.287292
C  9.478176 8.133055 3.288389
H  9.232705 8.68393 2.388449
C  9.331935 8.747566 4.529635
H  8.977897 9.765483 4.619345
N  9.616536 8.115679 5.674785
O  8.186273 10.496337 11.501804
O  9.777921 11.419764 12.854654
C  8.757318 11.427081 12.166086
C  7.980311 12.783658 12.114366
F  7.068955 12.863345 11.113797
F  7.309683 12.985072 13.283837
F  8.828596 13.830558 11.95962
O  8.459584 10.571851 6.990169
O  10.155353 11.722733 5.987427
C  9.045875 11.601168 6.502319
C  8.113998 12.858001 6.551966
F  7.207793 12.816107 5.534495
F  8.80666 14.012817 6.419541
F  7.409354 12.945722 7.708802
O  11.380617 9.441007 8.109038
O  11.14634 9.903709 10.329034
C  11.763633 9.553981 9.305946
C  13.25773 9.125664 9.504156
F  13.379076 7.767435 9.372813
F  14.088087 9.681717 8.581651
F  13.756136 9.442529 10.723812
Cu 6.297138 7.740442 9.289102
Cu 5.958128 7.696066 12.760753
O  6.943338 7.430041 11.104988
H  7.266378 6.51389 11.146838
N  5.776161 8.504357 7.474826
C  6.091095 7.97903 6.283333
H  6.599532 7.025097 6.301604
C  5.785329 8.620707 5.087204
H  6.064997 8.15994 4.147505
C  5.127122 9.847782 5.12876
H  4.876601 10.371644 4.213036
C  4.803886 10.403105 6.362327
H  4.305835 11.362871 6.433509
C  5.149172 9.71044 7.520508
C  4.913405 10.191958 8.870898
C  4.317995 11.32255 9.393212
H  3.845383 12.176918 8.93715
N  4.420431 11.189939 10.761617
C  5.084328 9.982172 11.022622
N  5.378496 9.385517 9.880878
C  4.002718 11.973921 11.801227
H  3.491865 12.893998 11.550681
C  4.251876 11.549303 13.076107
H  3.920492 12.156643 13.906353
C  4.916874 10.317178 13.289195
N  5.321286 9.560089 12.264334
C  5.19292 9.745363 14.609814
C  5.017313 10.436285 15.807142
H  4.657978 11.457701 15.800965
C  5.324706 9.797938 17.005876
H  5.200404 10.319471 17.948128
C  5.795232 8.488592 16.974157
H  6.046909 7.954033 17.8822
C  5.947332 7.85687 15.742239
H  6.311539 6.841332 15.66794
N  5.655581 8.468353 14.587867
O  7.105311 6.01111 8.801648
O  5.511593 5.080117 7.457218
C  6.526778 5.073312 8.153666
C  7.280595 3.705844 8.246734
F  8.194567 3.643058 9.246342
F  7.942123 3.452838 7.082576
F  6.414059 2.680323 8.440251
O  6.799805 5.985758 13.303664
O  5.101076 4.874399 14.3446
C  6.207292 4.973209 13.817572
C  7.12265 3.703591 13.790341
F  8.004113 3.736274 14.830101
F  6.409432 2.559431 13.910142
F  7.853803 3.600211 12.652275
O  3.890947 7.111814 12.172426
O  4.13345 6.607539 9.962337
C  3.513136 6.978892 10.975596
C  2.021873 7.41082 10.763676
F  1.904761 8.771097 10.877347
F  1.184361 6.869527 11.688583
F  1.528737 7.080583 9.545401
elementType: Cu O H N C F
cpcmener: -0.16566780093719 hartree
exchangeener: -868.434771400201 hartree
correlationener: -27.371780258691 hartree
xcener: -895.806551658892 hartree
s2: 6.007689
chargesum: -0.0000000
charge: 0.513219 0.495950 -0.679593 0.282015 -0.099621 0.073661 0.101940 -0.095982 0.114216 -0.031150 0.121375 -0.134112 0.098186 0.056779 0.308605 -0.131014 0.141078 0.141870 0.253162 -0.050238 0.003287 0.138076 -0.089157 0.106124 0.262311 -0.001127 0.115243 -0.096488 0.098801 -0.038797 0.129029 -0.070630 0.124115 0.033775 0.110000 -0.113087 -0.506058 -0.447760 0.291323 0.446006 -0.169688 -0.173251 -0.159072 -0.491091 -0.433471 0.314261 0.434299 -0.168358 -0.155897 -0.165333 -0.518136 -0.477959 0.293048 0.402302 -0.174566 -0.166490 -0.165282 0.516351 0.492645 -0.677632 0.282110 -0.098151 0.073889 0.101009 -0.094907 0.114283 -0.032801 0.121894 -0.134214 0.097826 0.059818 0.305814 -0.128290 0.141478 0.141237 0.249071 -0.053496 0.002906 0.137784 -0.088351 0.106000 0.270260 -0.000682 0.104891 -0.096047 0.098638 -0.039874 0.128939 -0.069893 0.124225 0.032658 0.110566 -0.108535 -0.509219 -0.447637 0.292250 0.446287 -0.169607 -0.173201 -0.159537 -0.489361 -0.434158 0.312078 0.437394 -0.169119 -0.156298 -0.165524 -0.518073 -0.477231 0.292699 0.402972 -0.174703 -0.166618 -0.165461
charge: -0.163577 -0.135561 0.225546 -0.112403 0.298268 -0.015539 0.033528 0.020527 0.033018 0.042081 0.036124 0.043413 0.037944 -0.109278 -0.129706 0.017174 0.028863 0.371261 -0.234833 0.281712 0.039848 0.046192 0.032372 0.042938 -0.092362 0.308312 -0.100932 0.052607 0.037663 0.050659 0.038157 0.030395 0.036167 -0.011757 0.033782 0.290181 0.152310 0.046251 -0.570283 -0.618181 0.188241 0.176690 0.181794 0.140835 0.045737 -0.569532 -0.620113 0.175938 0.186410 0.180661 0.098950 0.092026 -0.582008 -0.614134 0.160841 0.170097 0.177158 -0.162160 -0.135017 0.225648 -0.112605 0.298518 -0.015501 0.033878 0.020685 0.033047 0.042178 0.036183 0.043534 0.037888 -0.109047 -0.129896 0.017406 0.028847 0.371241 -0.235476 0.281412 0.039668 0.046125 0.031844 0.042960 -0.093002 0.308403 -0.101093 0.052463 0.037650 0.050646 0.038142 0.030340 0.036139 -0.011750 0.033698 0.290372 0.151436 0.046652 -0.570010 -0.618245 0.187782 0.176570 0.181498 0.141303 0.045565 -0.569652 -0.619977 0.175510 0.185762 0.181769 0.097993 0.089892 -0.583380 -0.614134 0.160845 0.169945 0.177035
qa: 0.5132 0.4959 -0.6796 0.2820 -0.0996 0.0737 0.1019 -0.0960 0.1142 -0.0311 0.1214 -0.1341 0.0982 0.0568 0.3086 -0.1310 0.1411 0.1419 0.2532 -0.0502 0.0033 0.1381 -0.0892 0.1061 0.2623 -0.0011 0.1152 -0.0965 0.0988 -0.0388 0.1290 -0.0706 0.1241 0.0338 0.1100 -0.1131 -0.5061 -0.4478 0.2913 0.4460 -0.1697 -0.1733 -0.1591 -0.4911 -0.4335 0.3143 0.4343 -0.1684 -0.1559 -0.1653 -0.5181 -0.4780 0.2930 0.4023 -0.1746 -0.1665 -0.1653 0.5164 0.4926 -0.6776 0.2821 -0.0982 0.0739 0.1010 -0.0949 0.1143 -0.0328 0.1219 -0.1342 0.0978 0.0598 0.3058 -0.1283 0.1415 0.1412 0.2491 -0.0535 0.0029 0.1378 -0.0884 0.1060 0.2703 -0.0007 0.1049 -0.0960 0.0986 -0.0399 0.1289 -0.0699 0.1242 0.0327 0.1106 -0.1085 -0.5092 -0.4476 0.2923 0.4463 -0.1696 -0.1732 -0.1595 -0.4894 -0.4342 0.3121 0.4374 -0.1691 -0.1563 -0.1655 -0.5181 -0.4772 0.2927 0.4030 -0.1747 -0.1666 -0.1655
va: 2.4334 2.5167 1.7145 0.9765 3.2454 4.0195 1.0245 3.9486 1.0048 3.9046 0.9988 3.9720 1.0152 3.9510 3.6346 3.9689 1.0064 3.5327 3.8501 3.1097 3.9268 1.0008 3.8677 1.0141 3.7900 3.1504 3.8412 3.9476 1.0155 3.9226 0.9957 3.9255 0.9986 4.0622 1.0200 3.2390 1.9506 2.0590 4.2200 4.4646 1.1373 1.1251 1.1531 1.9554 2.0694 4.1989 4.4795 1.1278 1.1598 1.1409 1.9078 1.9619 4.2411 4.4654 1.1092 1.1400 1.1458 2.4256 2.5232 1.7171 0.9759 3.2457 4.0221 1.0256 3.9487 1.0048 3.9073 0.9986 3.9703 1.0157 3.9518 3.6363 3.9693 1.0062 3.5319 3.8599 3.1082 3.9251 1.0010 3.8724 1.0140 3.7701 3.1510 3.8591 3.9476 1.0157 3.9229 0.9958 3.9247 0.9985 4.0615 1.0197 3.2415 1.9463 2.0603 4.2185 4.4654 1.1375 1.1259 1.1525 1.9574 2.0693 4.2004 4.4774 1.1269 1.1592 1.1415 1.9070 1.9654 4.2401 4.4634 1.1089 1.1398 1.1456
dispersion: -0.289266228 hartree
dipole: -0.010957120 0.035455663 0.024498543 0.003984138 0.000078995 0.004063134 -0.746819674 0.508021940 -0.238797734
dipolemethod: SCF
magnitude: 0.240085496 au
magnitude: 0.610248833 debye
temp: 298.15 k
press: 1.00 atm
zeropoint: 0.67754285 hartree
thermalvibcorrection: 0.08405965 hartree
thermalrotcorrection: 0.00141627 hartree
thermaltrasncorrection: 0.00141627 hartree
thermalcorr: 0.08689220 hartree
nonthermalcorr: 0.67754285 hartree
totalcorr: 0.76443505 hartree
thermalcorrenthalpy: 0.00094421 hartree
vibrat: 0.15805474 hartree
rotat: 0.01976470 hartree
transl: 0.02271870 hartree
total: 0.20205774 hartree
totalentropycorr: -0.20205774 hartree
gibbsminuselec: 0.56332152 hartree
