program: Orca
programVersion: 6.0.0
elementType: N C H C H C H C H C C C H N C N C H C H C N C C H C H C H C H N N C H C H C H C H C C C H N C N C H C H C N C C H C H C H C H N O H O H C C O O F F F C C O O F F F O H H O H H C C O O F F F C C O O F F F C C O O F F F C C O O F F F Ni Ni Ni Ni
charge: 0
multiplicity: 9
keywords: TPSS D3BJ Freq def2-TZVPP def2/J RIJCOSX TightSCF defgrid3 CPCM(Acetonitrile)
formula: C44H28F18N10Ni4O16
InChI: InChI=1/2C16H11N5.6C2F3O2.4Ni.2H2O.2HO/c2*1-3-8-17-12(5-1)14-7-10-21-11-15(20-16(21)19-14)13-6-2-4-9-18-13;6*3-2(4,5)1(6)7;;;;;;;;/h2*1-11H;;;;;;;;;;;2*1H2;2*1H/q2*-4;2*-2;4*-1;2*+3;2*+5;;;;/rC44H28F18N10Ni4O16/c45-39(46,47)31(77)83-75(84-32(78)40(48,49)50)67-17-7-3-11-25(67)29-21-63-19-13-27-23-9-1-5-15-65(23)73(81,69(27)37(63)71(29)75)87-35(43(57,58)59)89-76(85-33(79)41(51,52)53,86-34(80)42(54,55)56)68-18-8-4-12-26(68)30-22-64-20-14-28-24-10-2-6-16-66(24)74(82,91(73)75,92(73)76,70(28)38(64)72(30)76)88-36(90-75)44(60,61)62/h1-22,91-92H,81-82H2
120 atoms
N  9.500917 7.947099 13.293578
C  10.020644 8.790197 14.192992
H  10.674238 9.557605 13.793827
C  9.745916 8.686581 15.55441
H  10.189908 9.390194 16.249426
C  8.89822 7.669806 15.993645
H  8.663986 7.562359 17.047492
C  8.349812 6.794225 15.061961
H  7.67975 5.998034 15.36673
C  8.673043 6.962642 13.714314
C  8.166157 6.120156 12.641907
C  7.442035 4.946406 12.660044
H  7.043161 4.345812 13.461383
N  7.286951 4.593452 11.340241
C  7.93091 5.570899 10.55776
N  8.456987 6.494336 11.347547
C  6.657451 3.539064 10.74189
H  6.225017 2.788377 11.390177
C  6.588408 3.527075 9.380119
H  6.059376 2.721789 8.891471
C  7.172324 4.583788 8.634794
N  7.90815 5.537036 9.220622
C  6.867661 4.806607 7.218244
C  6.027256 3.963999 6.488296
H  5.677725 3.031497 6.911048
C  5.624024 4.344888 5.212969
H  4.976595 3.699812 4.629296
C  6.042012 5.575847 4.722321
H  5.72242 5.941719 3.753436
C  6.896094 6.351232 5.502091
H  7.227829 7.314301 5.146413
N  7.336689 5.971306 6.707658
N  11.13272 5.613507 3.245406
C  10.613865 4.770899 2.345026
H  9.96075 4.002593 2.743249
C  10.888892 4.876046 0.983793
H  10.445643 4.172774 0.287957
C  11.735924 5.893911 0.54579
H  11.970366 6.002613 -0.507882
C  12.283413 6.768992 1.478481
H  12.952928 7.566008 1.17466
C  11.95996 6.598984 2.825878
C  12.466097 7.440715 3.89922
C  13.190314 8.614419 3.882364
H  13.589473 9.21572 3.081695
N  13.345166 8.966056 5.202542
C  12.700927 7.987903 5.983964
N  12.174824 7.065338 5.193128
C  13.974954 10.01964 5.802023
H  14.407552 10.770922 5.154527
C  14.044196 10.030056 7.163798
H  14.573635 10.834569 7.653285
C  13.460019 8.972638 7.907921
N  12.723714 8.020434 7.321112
C  13.765156 8.747756 9.324065
C  14.605088 9.58969 10.055294
H  14.953976 10.52312 9.634063
C  15.008598 9.207015 11.330002
H  15.655557 9.85165 11.914682
C  14.591656 7.974899 11.818656
H  14.911697 7.607648 12.786873
C  13.738224 7.200067 11.037604
H  13.407844 6.235768 11.391312
N  13.297127 7.581804 9.832793
O  10.20292 7.728026 9.224795
H  10.400182 8.667241 9.004531
O  10.429672 5.828308 7.31414
H  10.232316 4.88889 7.53342
C  13.113865 1.833683 5.104951
C  12.629793 3.059576 5.949086
O  12.129828 3.992241 5.276305
O  12.856942 2.962571 7.175806
F  12.587785 1.791385 3.858515
F  12.818213 0.651886 5.704072
F  14.471629 1.876016 4.960857
C  9.38444 9.676449 4.627597
C  9.411565 8.323302 5.40413
O  9.280405 8.465517 6.645687
O  9.536718 7.283782 4.719561
F  9.542881 9.527084 3.294893
F  10.375261 10.502361 5.062631
F  8.207154 10.326301 4.825229
O  13.437109 5.36734 7.997252
H  13.124692 4.444591 7.741922
H  14.024495 5.23294 8.756807
O  7.192195 8.189521 8.534736
H  6.611233 8.325631 7.770559
H  7.504591 9.111573 8.79286
C  7.516787 11.72428 11.429719
C  8.001156 10.497361 10.58724
O  7.772983 10.59258 9.360562
O  8.502642 9.566261 11.26098
F  8.039092 11.765876 12.67775
F  6.158546 11.684811 11.56959
F  7.816769 12.905331 10.831124
C  12.022178 11.6520 11.153245
C  11.407723 10.330186 10.588953
O  11.293615 9.405782 11.446171
O  11.067078 10.364316 9.392913
F  12.803088 12.287951 10.243643
F  12.77137 11.474741 12.268031
F  11.019671 12.517226 11.484633
C  11.246942 3.881977 11.914228
C  11.220913 5.234359 11.136293
O  11.095359 6.274649 11.819487
O  11.353257 5.090581 9.894934
F  10.255189 3.056664 11.480167
F  11.088882 4.032889 13.246788
F  12.423491 3.230647 11.717099
C  8.611001 1.905871 5.382031
C  9.224707 3.227507 5.947617
O  9.338704 4.152607 5.091165
O  9.56501 3.192451 7.143739
F  9.614207 1.041639 5.049837
F  7.861854 2.083701 4.267326
F  7.830502 1.268468 6.290895
Ni 9.874867 7.939499 11.231863
Ni 8.777946 6.935462 7.929962
Ni 11.854395 6.620249 8.610884
Ni 10.757339 5.619268 5.306692
elementType: N C H O F Ni
cpcmener: -0.12613622859221 hartree
exchangeener: -871.073999432815 hartree
correlationener: -27.804787791396 hartree
xcener: -898.878787224211 hartree
s2: 20.017723
chargesum: -0.0000000
charge: -0.136702 0.022612 0.104603 -0.083195 0.117022 -0.043993 0.121380 -0.131313 0.097692 0.121708 0.193185 -0.124953 0.138906 0.122235 0.173365 -0.205888 0.012452 0.138763 -0.147294 0.101427 0.226878 -0.187416 0.148734 -0.108800 0.089113 -0.024783 0.122629 -0.099981 0.117415 0.095423 0.074654 -0.191992 -0.136535 0.022644 0.104569 -0.083247 0.117017 -0.043941 0.121383 -0.131406 0.097678 0.121525 0.193316 -0.124887 0.138898 0.122175 0.173463 -0.206150 0.012452 0.138763 -0.147452 0.101390 0.226122 -0.187211 0.150384 -0.108887 0.089278 -0.024865 0.122658 -0.099839 0.117445 0.094999 0.074666 -0.192277 -0.907810 0.313863 -0.907767 0.313827 0.433660 0.265956 -0.435809 -0.472594 -0.166139 -0.168079 -0.168981 0.411874 0.363253 -0.461957 -0.469993 -0.160051 -0.165586 -0.161265 -0.442403 0.275837 0.233560 -0.442350 0.233622 0.275879 0.433497 0.266173 -0.472660 -0.435584 -0.166117 -0.168931 -0.168094 0.437784 0.322579 -0.528525 -0.497419 -0.164370 -0.168231 -0.165643 0.411941 0.363087 -0.469639 -0.461917 -0.165568 -0.160008 -0.161250 0.437763 0.322705 -0.528537 -0.497347 -0.165716 -0.168279 -0.164383 0.857847 0.934300 0.934084 0.857897
charge: 0.293143 -0.039599 0.021255 0.009518 0.029901 0.032634 0.033313 0.035580 0.034951 -0.124040 -0.141860 0.003956 0.026267 0.363832 -0.249631 0.267837 0.031880 0.043807 0.024199 0.039108 -0.102918 0.297298 -0.123567 0.035857 0.031532 0.037958 0.035632 0.019206 0.032888 -0.028879 0.021999 0.296332 0.293150 -0.039595 0.021272 0.009511 0.029900 0.032627 0.033311 0.035575 0.034951 -0.124050 -0.141908 0.003926 0.026259 0.363829 -0.249641 0.267848 0.031864 0.043800 0.024164 0.039096 -0.103014 0.297313 -0.123517 0.035837 0.031529 0.037994 0.035640 0.019238 0.032897 -0.028837 0.022114 0.296306 0.220888 -0.163374 0.220743 -0.163484 -0.621928 -0.577141 0.157814 0.073889 0.183219 0.177063 0.166111 -0.622686 -0.548992 0.176342 0.175868 0.195158 0.182017 0.181350 0.398167 -0.166617 -0.087220 0.397768 -0.087215 -0.166720 -0.621893 -0.577022 0.074042 0.157970 0.183223 0.166178 0.176977 -0.622760 -0.584369 0.154514 0.066994 0.183712 0.187138 0.172871 -0.622702 -0.548972 0.175951 0.176276 0.182031 0.195185 0.181356 -0.622761 -0.584407 0.154506 0.066965 0.172768 0.187147 0.183765 -0.192016 -0.155194 -0.155362 -0.191905
qa: -0.1367 0.0226 0.1046 -0.0832 0.1170 -0.0440 0.1214 -0.1313 0.0977 0.1217 0.1932 -0.1250 0.1389 0.1222 0.1734 -0.2059 0.0125 0.1388 -0.1473 0.1014 0.2269 -0.1874 0.1487 -0.1088 0.0891 -0.0248 0.1226 -0.1000 0.1174 0.0954 0.0747 -0.1920 -0.1365 0.0226 0.1046 -0.0832 0.1170 -0.0439 0.1214 -0.1314 0.0977 0.1215 0.1933 -0.1249 0.1389 0.1222 0.1735 -0.2062 0.0125 0.1388 -0.1475 0.1014 0.2261 -0.1872 0.1504 -0.1089 0.0893 -0.0249 0.1227 -0.0998 0.1174 0.0950 0.0747 -0.1923 -0.9078 0.3139 -0.9078 0.3138 0.4337 0.2660 -0.4358 -0.4726 -0.1661 -0.1681 -0.1690 0.4119 0.3633 -0.4620 -0.4700 -0.1601 -0.1656 -0.1613 -0.4424 0.2758 0.2336 -0.4424 0.2336 0.2759 0.4335 0.2662 -0.4727 -0.4356 -0.1661 -0.1689 -0.1681 0.4378 0.3226 -0.5285 -0.4974 -0.1644 -0.1682 -0.1656 0.4119 0.3631 -0.4696 -0.4619 -0.1656 -0.1600 -0.1612 0.4378 0.3227 -0.5285 -0.4973 -0.1657 -0.1683 -0.1644 0.8578 0.9343 0.9341 0.8579
va: 3.0557 4.0066 1.0330 3.9157 1.0010 3.9052 0.9988 3.9597 1.0134 3.8386 3.7740 3.9761 1.0074 3.5132 4.0542 2.9764 3.9058 1.0011 3.9275 1.0208 3.8381 2.9940 3.8076 3.9358 1.0273 3.9026 0.9965 3.9660 0.9997 3.9453 1.0563 3.0761 3.0557 4.0066 1.0331 3.9157 1.0010 3.9052 0.9988 3.9599 1.0134 3.8391 3.7738 3.9761 1.0074 3.5133 4.0542 2.9763 3.9059 1.0011 3.9279 1.0209 3.8382 2.9934 3.8047 3.9359 1.0274 3.9029 0.9965 3.9654 0.9997 3.9464 1.0560 3.0762 1.4660 0.9948 1.4657 0.9948 4.4816 4.2543 1.9380 2.0392 1.1414 1.1361 1.1328 4.5311 4.1056 1.9954 1.9548 1.1598 1.1449 1.1500 2.0435 1.0352 1.0093 2.0434 1.0093 1.0350 4.4817 4.2541 2.0393 1.9379 1.1415 1.1330 1.1360 4.4994 4.1869 1.9226 2.0064 1.1444 1.1415 1.1383 4.5307 4.1056 1.9553 1.9955 1.1448 1.1599 1.1500 4.4994 4.1868 1.9226 2.0065 1.1382 1.1414 1.1445 3.3373 3.2581 3.2583 3.3372
dispersion: -0.299891681 hartree
dipole: 0.018647100 -0.011257756 0.007389344 -0.004938890 0.007868466 0.002929575 0.021599800 -0.009247869 0.012351931
dipolemethod: SCF
magnitude: 0.014688602 au
magnitude: 0.037335458 debye
temp: 298.15 k
press: 1.00 atm
zeropoint: 0.73076747 hartree
thermalvibcorrection: 0.08664593 hartree
thermalrotcorrection: 0.00141627 hartree
thermaltrasncorrection: 0.00141627 hartree
thermalcorr: 0.08947847 hartree
nonthermalcorr: 0.73076747 hartree
totalcorr: 0.82024594 hartree
thermalcorrenthalpy: 0.00094421 hartree
vibrat: 0.15871679 hartree
rotat: 0.01984800 hartree
transl: 0.02273418 hartree
total: 0.20337355 hartree
totalentropycorr: -0.20337355 hartree
gibbsminuselec: 0.61781660 hartree
