program: Gaussian 09
title: 000070207
version: EM64L-G09RevD.01
frameworkgroup: C1[X(C14H26O7S)]
method: RPBEPBE
basis: SDD
operation: Freq
keyword: #p
keyword: freq=noraman
keyword: PBEPBE/SDD
title: #p freq=noraman PBEPBE/SDD
converged: YES YES NO NO
title: Mulliken charges:
elementType: S O O O O O O O C C C C C C C C C C C C C C H H H H H H H H H H H H H H H H H H H H H H H H H H
charge: 1.034477 -0.238564 -0.249080 -0.564788 -0.483376 -0.503108 -0.213321 -0.245230 -0.485939 -0.562358 -0.383208 -0.345397 -0.382511 -0.344641 -0.275820 0.339871 -0.279278 -0.352286 -0.352265 0.281385 -0.692036 -0.691460 0.367200 0.308687 0.307642 0.212619 0.221204 0.189632 0.189982 0.212669 0.212264 0.190948 0.190461 0.231400 0.234347 0.230027 0.229026 0.200043 0.199018 0.198477 0.198427 0.210386 0.210338 0.219792 0.210596 0.211021 0.219464 0.383262
chargesum: 0.00000
title: Mulliken charges with hydrogens summed into heavy atoms:
elementType: S O O O O O O O C C C C C C C C C C C C C C
charge: 1.034477 -0.238564 -0.249080 -0.181525 -0.483376 -0.503108 -0.213321 -0.245230 -0.118739 0.053970 0.050616 0.034217 0.042422 0.036769 0.189927 0.339871 0.179775 0.046775 0.044638 0.281385 -0.051520 -0.050379
polarizability: 2.71488582e+02 -1.98360643e+00 1.86750084e+02 6.79049344e+00 -4.23613144e+00 1.70304431e+02
1716.lowfreq: -12.8195 -4.4112 -0.0011 0.0013 0.0020 0.4020 5.6220 14.3719 19.9309
frequency: -1.0531 12.4598 19.5629 26.8726 31.8407 33.8799 41.7662 51.6474 51.8238 61.2730 87.9611 94.1433 102.5083 106.6205 117.7472 117.9323 125.4000 143.9843 153.8832 173.8224 177.5392 183.3546 211.6445 225.8796 230.4096 233.1313 242.8169 267.0417 275.9489 299.9378 316.9738 322.0144 366.9661 400.0019 416.8207 443.9307 461.9526 477.0847 529.1004 543.5974 566.7043 648.7813 667.3294 729.3330 729.9292 753.9925 761.6750 763.1286 841.8448 842.6697 843.5204 846.9165 865.1221 889.4987 900.6599 914.3168 937.9307 964.4182 964.8960 967.8215 987.5922 1020.1919 1020.8476 1039.9156 1067.6735 1068.8270 1076.2094 1077.2863 1107.1143 1127.0315 1127.2569 1147.5456 1149.0124 1149.3459 1160.0323 1166.0859 1202.7204 1202.8942 1211.1761 1252.3948 1252.5834 1258.2866 1258.7569 1282.7557 1285.0951 1289.3216 1292.2144 1294.9358 1316.5655 1317.3602 1353.4997 1355.0990 1358.8907 1372.6075 1376.0620 1388.9882 1391.3945 1434.1200 1465.4110 1466.5237 1466.5975 1466.9063 1472.6996 1473.8170 1477.6500 1478.2408 1481.7697 1482.6425 1489.2857 1489.9016 1629.2320 1631.9292 2957.3993 2959.4676 2971.6309 2972.0955 2972.5142 2973.5513 2974.3179 2993.2132 2995.4144 2998.9753 3000.1847 3004.7000 3006.4773 3026.6710 3027.2243 3040.1434 3049.9797 3051.2584 3070.0818 3070.1606 3070.7628 3074.4146 3075.1233 3081.8246 3082.0390 3495.4963
redmass: 4.5587 4.1270 4.6144 2.2625 3.9198 3.6965 3.2404 3.4630 4.6321 4.3391 5.4939 2.4723 2.0870 3.8537 2.1206 2.2816 1.5273 4.0409 4.6706 3.5161 3.6761 4.2452 4.3164 5.8549 1.1131 1.1072 4.8287 4.4978 4.0010 7.3027 4.6858 4.7876 3.8227 9.0338 4.2374 3.3295 3.7491 6.2378 9.6118 3.5089 4.6344 5.7409 6.7469 1.0679 1.0683 6.5122 1.1368 1.1072 2.1176 1.6668 1.4015 6.3653 4.1347 2.6406 2.5983 3.0215 5.1909 1.1979 1.1611 9.5763 2.7535 3.6715 3.6652 1.1781 2.4093 2.3964 2.5702 2.5790 3.2668 2.6337 2.6500 1.7476 1.4789 1.8010 2.8126 1.3275 1.4219 1.4279 1.3845 1.2897 1.2845 1.2214 1.2271 1.0956 1.0854 1.4873 1.0891 1.0928 1.3358 1.3622 1.5168 1.5495 1.6854 1.5495 1.6794 1.2228 1.2203 1.0830 1.0831 1.0701 1.0797 1.0706 1.0709 1.0702 1.0422 1.0428 1.0729 1.0727 1.0932 1.0933 10.1549 9.4885 1.0587 1.0586 1.0588 1.0587 1.0672 1.0369 1.0372 1.0598 1.0610 1.0983 1.0990 1.0565 1.0565 1.1030 1.1029 1.0850 1.1041 1.1042 1.0927 1.0999 1.1012 1.0992 1.0993 1.1081 1.1083 1.0665
irintensity: 0.1202 0.0758 0.3150 0.2036 0.2934 0.1759 0.2231 0.7718 0.2436 1.5820 0.8116 0.0088 0.3670 0.8023 1.8295 0.9295 58.3727 6.0925 2.3358 2.2380 9.2159 4.1725 25.2740 13.4790 0.0496 0.0546 7.7763 5.5548 7.1143 31.4829 7.6749 19.1461 33.4838 64.5882 0.3476 15.2475 3.7225 9.7918 96.6953 11.9852 11.3699 6.8348 1.3052 10.6593 10.8439 10.5904 0.3616 0.0388 5.3173 4.2743 10.4419 68.2890 9.5520 25.9589 8.2863 3.1364 122.0388 1.9924 0.8798 55.6062 33.3902 0.6228 17.4393 59.3751 56.7477 34.1140 6.2833 13.4060 55.1537 1.0819 0.8935 93.6224 0.6650 111.0826 435.9359 22.5644 0.8432 0.7003 181.5407 9.5042 4.0839 0.0965 0.0582 0.7651 0.1115 184.9393 0.8395 0.6679 0.1351 9.8450 12.3305 1.1587 39.9880 5.8046 16.3145 12.9092 11.2655 54.9039 0.6095 0.2515 0.1160 0.3036 3.2030 3.6187 13.0359 12.9741 1.2310 0.4406 24.1104 26.0843 305.5077 36.5252 9.7442 7.0005 51.9569 53.2062 34.0659 34.0896 29.2670 19.9975 9.4066 2.1227 1.1080 33.7202 33.0326 18.6977 16.6569 33.3157 10.2028 5.2746 12.5868 54.2239 62.6029 49.3194 49.7565 57.9003 91.1172 51.0960
temp: 298.150 k
press: 1.00000 atm
elementType: 16 8 8 8 8 8 8 8 6 6 6 6 6 6 6 6 6 6 6 6 6 6 1 1 1 1 1 1 1 1 1 1 1 1 1 1 1 1 1 1 1 1 1 1 1 1 1 1
symmnumber: 1
zpe: 1021546.2 jmol-1
zpe.correction: 0.389086 hartree
zpe.thermalcorrener: 0.416947 hartree
zpe.thermalcorrenthalpy: 0.417891 hartree
zpe.thermalcorrgfe: 0.325109 hartree
zpe.sumelectzpe: -1471.771656 hartree
zpe.sumelectthermal: -1471.743795 hartree
zpe.sumelectthermalent: -1471.742851 hartree
zpe.sumelectthermalfe: -1471.835633 hartree
dipole: 0.2877 -2.4017 1.5082
dipole: 2.8506
quadrupole: -105.7239 -145.7623 -151.1692
quadrupole: -0.7176 -5.4200 8.2570
quadrupole: 28.4946 -11.5438 -16.9508 -0.7176 -5.4200 8.2570
hfenergy: -1472.160742 hartree
pointgroup: C01 [X(C14H26O7S1)]
dipole: -0.8684134 -0.2504458 -0.6640016 debye
polarizability: 191.5363494|-19.9327214|259.4227866|11.9575188|-23.6454436|177.5839615 unknown
InChI: InChI=1S/C14H26O7S/c1-3-5-7-9-20-13(15)11-12(22(17,18)19)14(16)21-10-8-6-4-2/h12,17H,3-11H2,1-2H3
charge 0 multiplicity 1
48 atoms
S  1.968617 -0.572321 0.698406
O  -0.397883 -2.667816 0.669923
O  -1.494576 2.857117 -0.767269
O  2.267047 -1.697028 -0.754501
O  2.285263 -1.356731 2.068917
O  2.717787 0.835096 0.408625
O  -1.02957 -1.767104 -1.393038
O  -1.703225 1.701087 1.246318
C  0.007877 -0.356028 0.334188
C  -0.182164 0.880124 -0.528221
C  -0.479656 -4.992963 1.376795
C  -0.817659 -6.458559 1.013969
C  -2.598981 4.937428 -1.381227
C  -3.549311 6.086102 -0.965472
C  -0.775785 -4.045935 0.216395
C  -0.522026 -1.655537 -0.255572
C  -2.458139 3.896256 -0.27293
C  -0.521932 -7.438642 2.172456
C  -3.713318 7.150891 -2.074147
C  -1.20417 1.822558 0.10245
C  -0.853041 -8.90359 1.816168
C  -4.646225 8.307852 -1.656337
H  -0.356776 -0.21751 1.369579
H  0.767776 1.443688 -0.639218
H  -0.50583 0.592525 -1.543197
H  -1.065264 -4.679831 2.262168
H  0.588666 -4.906402 1.651063
H  -1.8888 -6.538698 0.733885
H  -0.236493 -6.766655 0.119937
H  -1.599871 5.34708 -1.624107
H  -2.97885 4.44714 -2.297894
H  -3.164233 6.574391 -0.046257
H  -4.546456 5.673182 -0.706571
H  -1.845864 -4.034288 -0.061589
H  -0.179229 -4.277485 -0.685346
H  -2.05083 4.325836 0.660802
H  -3.414822 3.394787 -0.037763
H  0.547392 -7.356495 2.453932
H  -1.103022 -7.132193 3.065649
H  -2.715907 7.555308 -2.340775
H  -4.108101 6.665886 -2.989727
H  -1.923823 -9.019201 1.562948
H  -0.263467 -9.243237 0.943737
H  -0.630535 -9.583136 2.658962
H  -5.657659 7.933236 -1.409991
H  -4.254857 8.829512 -0.762696
H  -4.750329 9.054501 -2.464583
H  3.241051 -1.923202 -0.769645
