program: Gaussian 09
title: 000070063
version: EM64L-G09RevD.01
frameworkgroup: C1[X(C12H6Cl2N2O6S)]
method: RPBEPBE
basis: SDD
operation: Freq
keyword: #p
keyword: freq=noraman
keyword: PBEPBE/SDD
title: #p freq=noraman PBEPBE/SDD
converged: YES YES NO NO
title: Mulliken charges:
elementType: Cl Cl S O O O O O O N N C C C C C C C C C C C C H H H H H H
charge: -0.008000 -0.007993 0.179748 -0.347478 -0.347409 -0.197274 -0.197358 -0.157352 -0.157337 0.015523 0.015563 -0.269748 -0.269785 0.201070 0.201099 0.334544 0.334448 -0.188368 -0.188358 -0.317584 -0.317615 -0.114389 -0.114383 0.276401 0.276402 0.315200 0.315265 0.367595 0.367575
chargesum: 0.00000
title: Mulliken charges with hydrogens summed into heavy atoms:
elementType: Cl Cl S O O O O O O N N C C C C C C C C C C C C
charge: -0.008000 -0.007993 0.179748 0.020117 0.020166 -0.197274 -0.197358 -0.157352 -0.157337 0.015523 0.015563 -0.269748 -0.269785 0.201070 0.201099 0.334544 0.334448 0.088033 0.088044 -0.002384 -0.002350 -0.114389 -0.114383
polarizability: 2.67368049e+02 -1.18885751e+01 2.47823331e+02 -2.13068741e-02 -1.19098262e-02 1.38260334e+02
1716.lowfreq: -5.4544 -2.4007 -0.0018 -0.0017 0.0022 2.8943 7.8669 12.7785 24.8852
frequency: 6.0985 12.6651 24.8840 35.8999 36.8295 78.3268 88.3942 119.6230 124.4578 137.8230 159.4189 162.0159 180.3510 211.2834 216.3752 287.1405 317.9699 320.4443 324.8950 346.4482 348.2385 356.0303 359.0073 389.7636 391.0331 405.1709 415.1082 470.2933 497.6969 544.5627 554.5367 560.2632 561.4437 591.1975 599.3389 658.2799 668.0232 684.7285 688.9689 701.3658 706.3789 741.9216 746.0022 795.0429 799.5126 850.5850 851.0605 875.8241 879.9130 921.3391 921.7992 1063.3577 1073.8777 1110.9492 1118.5246 1135.5760 1145.6412 1196.5754 1198.3245 1225.7533 1227.2246 1274.4177 1283.5252 1361.2511 1362.9575 1379.8010 1380.1339 1399.2263 1400.2238 1439.5420 1446.4815 1571.0935 1573.5538 1593.7334 1594.0628 3170.4276 3170.4668 3185.8251 3185.8671 3375.3662 3381.2347
redmass: 15.2738 16.4506 14.2025 15.8620 16.1057 11.3057 11.0871 12.2746 10.1268 10.6184 12.4572 15.2064 5.2365 5.3739 16.0365 8.4867 10.3106 11.9441 8.5012 9.8713 14.3151 12.3528 10.9034 8.6069 8.0833 8.5193 9.2064 5.3548 4.9188 3.8284 2.6995 1.4203 1.1201 5.2651 4.0976 9.0778 9.9649 11.1427 9.9945 10.5313 10.2934 6.8641 6.8165 8.2675 8.0842 8.7313 8.7429 1.4434 1.4658 1.4093 1.4094 3.1563 2.5806 2.4945 3.6354 1.8171 1.6236 12.0512 10.9836 1.8185 1.9876 2.0069 1.9275 4.9206 5.1648 7.0032 7.6118 4.6158 4.5067 4.2852 4.1396 6.8642 6.7097 8.2412 8.3580 1.0939 1.0939 1.0929 1.0930 1.0642 1.0645
irintensity: 2.5318 1.0278 0.7301 0.9896 0.0932 0.4466 0.0478 0.7160 0.7252 2.0311 0.4393 2.1997 0.5301 0.7398 2.1749 1.5837 15.0289 0.0159 1.8763 2.9594 2.8902 11.8436 0.0047 5.7568 0.0170 0.4487 0.0422 3.5740 6.0499 4.1009 41.7234 97.0237 156.6039 9.7805 7.5808 34.9862 0.5542 73.9695 2.3520 70.5962 35.9457 7.9021 10.3583 19.9499 1.6042 0.2933 15.1762 19.3572 18.7249 13.4449 12.0125 91.0975 0.8253 72.0316 14.5688 61.4432 56.6968 495.1195 56.7230 145.7084 23.1208 32.7435 1.6261 35.1965 18.3761 56.4781 191.6317 85.5690 1.8151 285.6269 46.8526 39.5271 0.8133 2.2586 0.1280 0.1235 1.2097 18.4647 5.9469 185.8330 51.6893
temp: 298.150 k
press: 1.00000 atm
elementType: 17 17 16 8 8 8 8 8 8 7 7 6 6 6 6 6 6 6 6 6 6 6 6 1 1 1 1 1 1
symmnumber: 1
zpe: 441127.6 jmol-1
zpe.correction: 0.168017 hartree
zpe.thermalcorrener: 0.189374 hartree
zpe.thermalcorrenthalpy: 0.190318 hartree
zpe.thermalcorrgfe: 0.112340 hartree
zpe.sumelectzpe: -2338.066885 hartree
zpe.sumelectthermal: -2338.045528 hartree
zpe.sumelectthermalent: -2338.044584 hartree
zpe.sumelectthermalfe: -2338.122562 hartree
dipole: -0.0017 0.0000 3.2010
dipole: 3.2010
quadrupole: -199.3324 -167.6893 -144.5907
quadrupole: 25.2002 0.0094 0.0063
quadrupole: -28.7950 2.8482 25.9468 25.2002 0.0094 0.0063
hfenergy: -2338.234902 hartree
pointgroup: C01 [X(C12H6Cl2N2O6S1)]
dipole: 0.0006573 0.00009 1.2593829 debye
polarizability: 270.7010676|-8.0676082|244.490313|0.0190538|0.0152571|138.2603339 unknown
InChI: InChI=1S/C12H6Cl2N2O6S/c13-5-1-7(15(19)20)11(17)9(3-5)23-10-4-6(14)2-8(12(10)18)16(21)22/h1-4,17-18H
charge 0 multiplicity 1
29 atoms
Cl 2.120764 3.85912 -1.384882
Cl -2.120739 -3.859372 -1.384005
S  0.00002 0.000218 2.118792
O  2.534545 -1.503226 1.347456
O  -2.53434 1.503643 1.347124
O  5.671081 -0.036281 -0.923996
O  -5.670525 0.035939 -0.926114
O  4.526622 -1.944191 -0.413061
O  -4.528027 1.943785 -0.410726
N  4.616768 -0.666929 -0.517512
N  -4.61707 0.666659 -0.517429
C  1.303099 0.583248 0.924696
C  -1.303123 -0.583027 0.924886
C  2.414095 -0.287732 0.705122
C  -2.414153 0.287919 0.70516
C  3.427655 0.162271 -0.190403
C  -3.427774 -0.162317 -0.190201
C  1.202603 1.836973 0.295933
C  -1.202627 -1.83689 0.296428
C  3.347597 1.425444 -0.815697
C  -3.3476 -1.425608 -0.815294
C  2.235708 2.244158 -0.573027
C  -2.235721 -2.24426 -0.57246
H  0.342791 2.488211 0.475507
H  -0.342801 -2.488071 0.476149
H  4.164108 1.736423 -1.472394
H  -4.164102 -1.736674 -1.471956
H  1.784379 -1.607051 2.002173
H  -1.784132 1.607419 2.001829
