program: Gaussian 09
title: 000070032
version: EM64L-G09RevD.01
frameworkgroup: C1[X(C12H14O3)]
method: RPBEPBE
basis: SDD
operation: Freq
keyword: #pfreq=noraman
keyword: PBEPBE/SDD
title: #p freq=noraman PBEPBE/SDD
converged: YES YES NO NO
title: Mulliken charges:
elementType: O O O C C C C C C C C C C C C H H H H H H H H H H H H H H
charge: -0.216341 -0.419785 -0.224061 -0.377958 -0.514095 -0.474170 0.108277 0.291067 -0.339778 -0.347579 0.439716 -0.401171 -0.384950 0.171751 -0.805179 0.239953 0.239552 0.230331 0.230238 0.245298 0.245879 0.242234 0.276979 0.233003 0.235628 0.229679 0.240946 0.228172 0.376363
chargesum: 0.00000
title: Mulliken charges with hydrogens summed into heavy atoms:
elementType: O O O C C C C C C C C C C C C
charge: -0.216341 -0.043422 -0.224061 0.101547 -0.053526 0.017007 0.108277 0.291067 -0.097544 -0.070600 0.439716 -0.168167 -0.149322 0.171751 -0.106381
polarizability: 2.08132600e+02 -1.01174219e+01 1.38938102e+02 1.04283391e+00 1.95559932e-02 7.31144680e+01
1716.lowfreq: -27.5822 -23.3838 -3.7701 -0.0007 -0.0005 0.0005 2.5426 6.8804 25.8533
frequency: -27.4486 4.5032 25.7004 38.1879 54.0772 66.2062 92.2821 121.7311 135.9957 211.4693 248.2339 263.3401 343.4335 350.9915 404.0832 440.8061 458.8982 480.3869 500.4558 568.2135 587.1038 593.7913 634.5796 637.7900 718.4146 737.5036 746.1165 804.0198 816.8163 857.0019 865.7738 868.7248 966.4939 972.8886 992.1298 1000.0974 1012.2145 1027.2510 1046.9436 1056.3017 1077.7419 1092.6027 1123.3793 1138.1276 1188.3744 1209.7612 1225.8725 1241.9613 1251.4165 1282.0528 1282.7065 1307.7644 1344.0584 1372.8491 1374.8899 1396.7810 1412.1035 1431.1246 1437.9302 1468.3476 1468.9513 1472.8731 1503.3915 1563.4048 1595.6459 1622.8631 1673.3109 2956.3261 2976.7453 2982.8865 3003.5841 3026.2611 3029.2789 3058.7981 3087.2832 3089.5091 3123.1719 3127.1434 3148.7851 3158.6625 3512.1766
redmass: 1.0282 10.8171 3.8787 1.8691 5.6272 4.0747 3.8876 2.4046 6.5159 5.7597 5.8398 3.9605 3.1017 5.5584 2.8328 4.8021 2.7493 4.5775 1.7995 2.1536 5.1248 4.9025 6.9419 1.3057 2.1999 1.5969 4.5176 5.1029 1.4127 1.3313 1.5410 4.7217 1.3474 3.1754 1.6501 1.3599 2.8829 2.9462 1.5924 2.0385 2.0575 3.3057 1.3105 1.2368 1.2083 1.7474 2.7484 1.6524 1.2179 1.1514 1.7692 1.3072 1.9674 3.5727 2.1466 1.2209 3.6154 1.1058 1.0807 1.1017 1.0900 1.0568 2.6259 6.4102 7.7759 6.5526 8.3194 1.0598 1.0391 1.0607 1.0977 1.0612 1.0981 1.0942 1.1029 1.1000 1.0878 1.0891 1.0956 1.0957 1.0639
irintensity: 0.6343 0.1255 0.0079 0.6798 0.2628 2.3444 0.3258 1.1477 0.1439 0.0748 11.3273 1.1885 4.0540 1.2120 0.0403 25.7885 8.6707 43.0967 34.8884 4.8768 1.1084 6.2309 0.9434 126.9775 4.8044 32.4798 2.3172 1.3181 30.2064 0.0975 12.8633 2.1353 1.0609 24.1709 4.2659 2.0365 26.9465 263.3128 22.5071 0.5532 8.0845 57.3242 11.7280 1.0048 61.8596 15.4883 0.7803 45.1498 0.4591 32.1262 175.6567 6.3470 4.4997 4.0610 50.1566 13.9626 13.3343 1.0478 33.1486 8.3538 24.5772 13.2810 0.0691 82.8275 99.8788 36.0262 215.2557 25.1788 25.0779 11.9350 11.8856 7.7055 4.3437 21.0013 26.4143 16.0103 12.7869 17.4649 19.2459 5.1487 19.9699
temp: 298.150 k
press: 1.00000 atm
elementType: 8 8 8 6 6 6 6 6 6 6 6 6 6 6 6 1 1 1 1 1 1 1 1 1 1 1 1 1 1
symmnumber: 1
zpe: 607654.2 jmol-1
zpe.correction: 0.231443 hartree
zpe.thermalcorrener: 0.246230 hartree
zpe.thermalcorrenthalpy: 0.247174 hartree
zpe.thermalcorrgfe: 0.184748 hartree
zpe.sumelectzpe: -690.254354 hartree
zpe.sumelectthermal: -690.239568 hartree
zpe.sumelectthermalent: -690.238624 hartree
zpe.sumelectthermalfe: -690.301050 hartree
dipole: 2.8357 -4.4611 0.0327
dipole: 5.2861
quadrupole: -69.9134 -94.4072 -89.4560
quadrupole: 7.1868 0.8107 -0.3899
quadrupole: 14.6788 -9.8150 -4.8638 7.1868 0.8107 -0.3899
hfenergy: -690.4857977 hartree
pointgroup: C01 [X(C12H14O3)]
dipole: 1.1118326 -1.7575006 0.0173402 debye
polarizability: 208.094174|-10.2663393|138.9816971|0.5395318|-0.2797286|73.109299 unknown
InChI: InChI=1S/C12H14O3/c1-9-5-7-10(8-6-9)11(13)3-2-4-12(14)15/h5-8,14H,2-4H2,1H3
charge 0 multiplicity 1
29 atoms
O  -0.203029 1.990013 -0.03242
O  -5.878241 -1.284799 -0.009266
O  -5.282159 0.956236 0.103844
C  -2.443931 0.304931 0.012862
C  -1.029915 -0.302848 0.001276
C  -3.522233 -0.793588 0.011206
C  0.081031 0.755753 -0.015966
C  1.511707 0.299263 -0.013629
C  1.885089 -1.071761 0.001534
C  2.538667 1.282132 -0.031065
C  4.27278 -0.464379 -0.012172
C  3.244709 -1.443567 0.00039
C  3.893555 0.905575 -0.031985
C  -4.934609 -0.241773 0.04099
C  5.734661 -0.868468 0.019506
H  -2.565699 0.956863 0.895527
H  -2.573698 0.968612 -0.859872
H  -0.898213 -0.962413 -0.882375
H  -0.88076 -0.955415 0.887039
H  -3.412189 -1.468882 0.883579
H  -3.436488 -1.445678 -0.880577
H  1.119431 -1.854861 0.010329
H  2.240108 2.335768 -0.047288
H  3.516676 -2.505964 0.008589
H  4.67228 1.677474 -0.049323
H  6.372734 -0.122584 -0.485586
H  6.095816 -0.955433 1.063021
H  5.897302 -1.84678 -0.465479
H  -6.793983 -0.894228 0.015812
