program: Gaussian 09
title: 000070036
version: EM64L-G09RevD.01
frameworkgroup: C1[X(C14H14O)]
method: RPBEPBE
basis: SDD
operation: Freq
keyword: #pfreq=noraman
keyword: PBEPBE/SDD
title: #p freq=noraman PBEPBE/SDD
converged: NO YES NO NO
title: Mulliken charges:
elementType: O C C C C C C C C C C C C C C H H H H H H H H H H H H H H
charge: -0.262915 -0.460014 0.476982 0.339521 0.441071 -0.334910 -0.367661 -0.426803 -0.332678 -0.385459 -0.392852 -0.809623 -0.227441 -0.227488 -0.231633 0.209759 0.209802 0.246939 0.248764 0.225465 0.228736 0.235102 0.234214 0.228176 0.222114 0.227759 0.227565 0.227683 0.229822
chargesum: 0.00000
title: Mulliken charges with hydrogens summed into heavy atoms:
elementType: O C C C C C C C C C C C C C C
charge: -0.262915 -0.040453 0.476982 0.339521 0.441071 -0.087971 -0.118897 -0.201338 -0.103942 -0.150357 -0.158638 -0.131573 0.000124 0.000195 -0.001810
polarizability: 2.35131613e+02 -9.99020351e+00 1.15454864e+02 1.71440388e+00 8.24092125e-01 1.11338937e+02
1716.lowfreq: -15.6784 -9.8681 -5.7615 -0.0007 -0.0007 -0.0005 7.8782 29.1580 41.8703
frequency: -15.1740 29.1352 41.8013 58.0335 88.1975 151.5377 152.5740 232.2590 312.6236 321.8279 347.7784 402.2053 406.5189 413.7816 478.9050 507.9939 508.3150 596.3042 617.2862 634.1025 700.1153 710.6740 723.0944 767.3163 807.5700 808.6521 829.3283 847.7633 852.9834 922.0400 928.5700 947.2852 962.9741 976.1811 980.5486 985.0287 991.0502 997.3402 1005.9716 1026.9749 1046.6358 1090.1441 1121.0430 1172.8526 1177.3187 1187.7343 1194.4547 1211.3491 1222.6879 1229.2531 1305.9634 1326.5060 1355.6953 1375.0683 1387.3734 1399.1611 1415.3182 1440.8297 1470.2141 1477.4878 1480.9723 1487.0871 1501.6179 1584.3531 1597.4769 1618.0648 1626.3057 2955.5954 2972.0892 3013.8661 3048.0755 3079.6544 3120.1319 3121.9031 3122.8853 3124.3974 3136.3367 3148.7609 3157.8894 3163.4739 3164.8529
redmass: 3.5243 4.6364 1.0600 4.5410 3.6619 4.9620 4.3427 4.7565 3.0241 3.3022 2.7212 2.7999 3.8572 2.9452 6.1171 3.4764 2.5080 5.0953 6.3431 6.7796 2.1198 3.0159 2.4555 2.4587 1.4289 5.2009 1.3556 3.5548 1.2472 1.8795 1.3259 4.0664 1.3478 1.3920 1.5763 1.4634 5.7138 1.3470 2.6244 2.1795 1.5259 1.5030 1.2607 1.0535 1.3801 1.1141 1.0890 2.0812 3.9423 2.5022 1.2916 1.2692 1.5767 3.2155 8.4525 1.2483 3.5245 2.1886 1.0462 1.1015 1.1429 2.4155 2.4663 6.4040 6.1369 6.2047 6.4220 1.0557 1.0373 1.1072 1.0977 1.0984 1.0894 1.0852 1.0889 1.0882 1.0921 1.0964 1.0941 1.0953 1.1017
irintensity: 0.0192 0.4835 0.4678 0.3810 2.0642 0.6991 0.3880 0.2816 1.0867 5.7732 0.0097 0.0086 0.7621 0.0068 0.3062 11.0331 20.0916 10.7565 0.1546 0.7788 37.8155 0.4254 46.0555 40.9342 42.8628 0.6234 29.4641 22.8332 0.0011 63.9299 0.4516 70.8580 0.8976 0.0478 2.9039 0.0385 0.5983 0.0078 7.9235 5.0815 10.8894 7.0126 16.4605 0.0069 114.6798 1.1747 1.0641 210.9698 35.4694 11.4022 3.1831 0.2774 24.2862 23.4846 0.4131 10.6055 1.6794 9.1740 12.1769 12.1935 29.6529 0.9402 149.9198 21.0686 0.6261 0.0149 37.3536 40.3984 52.7884 28.4549 24.6605 20.4805 18.1550 6.0213 28.1257 1.6582 16.3104 41.0916 19.6559 3.2066 22.6725
temp: 298.150 k
press: 1.00000 atm
elementType: 8 6 6 6 6 6 6 6 6 6 6 6 6 6 6 1 1 1 1 1 1 1 1 1 1 1 1 1 1
symmnumber: 1
zpe: 621493.0 jmol-1
zpe.correction: 0.236714 hartree
zpe.thermalcorrener: 0.249363 hartree
zpe.thermalcorrenthalpy: 0.250308 hartree
zpe.thermalcorrgfe: 0.195944 hartree
zpe.sumelectzpe: -616.035878 hartree
zpe.sumelectthermal: -616.023229 hartree
zpe.sumelectthermalent: -616.022284 hartree
zpe.sumelectthermalfe: -616.076648 hartree
dipole: -0.3748 -1.1915 0.1675
dipole: 1.2603
quadrupole: -74.0850 -86.1537 -86.2623
quadrupole: -1.0923 0.2086 0.2891
quadrupole: 8.0820 -3.9867 -4.0953 -1.0923 0.2086 0.2891
hfenergy: -616.2725921 hartree
pointgroup: C01 [X(C14H14O1)]
dipole: 0.1537932 -0.470246 -0.0325641 debye
polarizability: 234.8371069|11.6856581|115.6100737|1.2126307|-1.0729126|111.4782342 unknown
InChI: InChI=1S/C14H14O/c1-12-7-9-14(10-8-12)15-11-13-5-3-2-4-6-13/h2-10H,11H2,1H3
charge 0 multiplicity 1
29 atoms
O  -0.002716 0.339759 0.021778
C  0.857356 -0.867232 -0.054486
C  2.297895 -0.413865 -0.023398
C  -1.395179 0.130764 0.009161
C  -4.246147 -0.049089 0.00134
C  -2.024725 -1.134704 -0.06939
C  -2.184953 1.306685 0.083679
C  -3.439059 -1.207424 -0.071997
C  -3.587414 1.210307 0.079433
C  2.971589 -0.077118 -1.223971
C  2.991645 -0.30874 1.207784
C  -5.763178 -0.133259 -0.003748
C  4.314466 0.359965 -1.195387
C  4.334927 0.127448 1.241034
C  4.999406 0.462306 0.038152
H  0.628354 -1.412423 -0.993133
H  0.627029 -1.528559 0.805669
H  -1.441659 -2.058646 -0.127254
H  -1.67731 2.27447 0.144433
H  -3.917554 -2.192584 -0.13331
H  -4.185626 2.128284 0.137849
H  2.439223 -0.150802 -2.179945
H  2.474848 -0.562923 2.141199
H  -6.196232 0.405075 -0.868388
H  -6.108979 -1.180327 -0.054494
H  -6.197264 0.318241 0.908683
H  4.825663 0.618526 -2.129372
H  4.861498 0.204997 2.19871
H  6.042098 0.798766 0.06137
