program: Gaussian 09
title: 000070012
version: EM64L-G09RevD.01
frameworkgroup: C1[X(C10H10N2)]
method: RPBEPBE
basis: SDD
operation: Freq
keyword: #pfreq=noraman
keyword: PBEPBE/SDD
title: #p freq=noraman PBEPBE/SDD
converged: YES YES NO NO
title: Mulliken charges:
elementType: N N C C C C C C C C C C H H H H H H H H H H
charge: -0.458038 -0.096163 0.089253 0.351530 0.382632 -0.452382 -0.372387 -0.369641 -0.802276 -0.225003 -0.237274 -0.243300 0.305412 0.259477 0.277452 0.191327 0.250462 0.234679 0.234470 0.227190 0.223695 0.228885
chargesum: 0.00000
title: Mulliken charges with hydrogens summed into heavy atoms:
elementType: N N C C C C C C C C C C
charge: -0.152627 -0.096163 0.089253 0.351530 0.382632 -0.192905 -0.094935 -0.178314 -0.082665 0.002187 -0.013579 -0.014415
polarizability: 2.06998392e+02 2.21240087e+00 1.20437479e+02 -2.18241809e-02 1.32509932e-02 5.26836178e+01
1716.lowfreq: -8.6651 -6.5690 -3.5211 -0.0008 -0.0007 -0.0002 33.8680 91.2071 114.8629
frequency: 33.7961 91.2058 114.8551 123.3476 206.1703 285.3588 309.4814 340.9788 400.2951 460.4832 498.4907 614.8102 629.8524 640.4743 647.8483 696.5892 697.6098 700.9985 778.2782 829.6098 842.4158 918.5871 924.4948 975.1959 976.3000 986.9049 1002.5560 1011.7705 1021.8536 1043.7911 1064.6414 1079.4510 1162.0949 1172.2168 1188.6333 1229.6996 1277.4292 1305.0849 1352.4544 1357.7420 1385.5076 1406.8447 1439.5254 1449.1173 1468.8925 1477.5539 1521.6524 1571.3876 1588.5583 1618.4986 2970.0661 3040.7996 3097.2292 3107.8353 3129.2282 3141.5399 3158.0553 3169.8030 3226.1270 3587.8901
redmass: 3.6994 2.7529 1.1983 3.9244 3.5399 3.4243 4.4316 5.1735 2.7813 4.2351 3.4224 6.4212 2.4509 5.0898 1.3584 1.6257 5.4818 5.8484 2.1579 1.3166 1.2662 1.4433 6.5547 1.3673 1.5506 5.3458 1.3337 4.4517 2.5802 1.4551 2.2158 1.6809 2.3539 1.0731 1.1243 1.8673 2.4074 1.5853 2.2169 4.5035 7.4168 1.2690 2.4326 2.4473 1.0434 1.1693 4.5362 4.5519 5.6656 5.9661 1.0390 1.0984 1.0957 1.0874 1.0864 1.0923 1.0960 1.0997 1.0987 1.0809
irintensity: 5.0066 0.1927 0.1070 3.0803 0.0001 0.4708 0.0956 0.4426 0.1246 3.9244 5.6802 0.1546 21.8974 5.6841 36.7334 108.3586 2.9983 0.6805 47.9092 38.4437 0.0186 6.5059 7.6504 0.2358 2.4305 0.4501 1.1652 11.2554 4.3218 6.0350 2.9656 16.3936 3.4163 0.0116 0.0244 36.7409 4.2466 0.6832 21.3967 2.1806 4.0288 0.5361 17.2456 22.0474 16.1437 2.1356 35.1028 48.2374 7.5734 17.7224 60.1772 23.9366 11.9346 20.5285 0.0930 31.7398 22.1658 17.0679 10.9647 19.6023
temp: 298.150 k
press: 1.00000 atm
elementType: 7 7 6 6 6 6 6 6 6 6 6 6 1 1 1 1 1 1 1 1 1 1
symmnumber: 1
zpe: 463851.8 jmol-1
zpe.correction: 0.176672 hartree
zpe.thermalcorrener: 0.186791 hartree
zpe.thermalcorrenthalpy: 0.187735 hartree
zpe.thermalcorrgfe: 0.140103 hartree
zpe.sumelectzpe: -495.730419 hartree
zpe.sumelectthermal: -495.720300 hartree
zpe.sumelectthermalent: -495.719356 hartree
zpe.sumelectthermalfe: -495.766987 hartree
dipole: 1.2579 -3.7006 -0.0087
dipole: 3.9085
quadrupole: -55.0193 -65.4863 -75.9523
quadrupole: -4.6148 -0.0101 0.0147
quadrupole: 10.4666 -0.0003 -10.4664 -4.6148 -0.0101 0.0147
hfenergy: -495.9070908 hartree
pointgroup: C01 [X(C10H10N2)]
dipole: 0.4619931 -1.4664669 0.0255543 debye
dipolederiv: -0.0647942 -0.0974537 -0.0000164 0.0354087 -0.4964045 0.0068704 -0.0030363 0.0100486 -0.2283996 -0.1132956 0.0518907 -0.0031071 0.0088542 -0.4092446 0.0037359 -0.0021354 0.00307 -0.2465543 -0.0142287 -0.06515 0.0016828 -0.1638199 0.3314698 -0.004566 0.0024206 -0.0063608 0.0331562 0.6682447 0.0693429 -0.0112654 0.0707736 -0.0228909 0.0005648 -0.0101773 0.0004793 0.0492749 -0.078341 0.0860099 -0.0004127 -0.4981781 0.2713792 -0.0000103 0.0147091 -0.0097489 -0.0313519 -0.2149229 0.0288165 -0.0005081 0.5095857 0.0975753 -0.014658 -0.0115142 -0.0073932 -0.2098005 -0.3132289 0.0477125 0.0011573 0.1443264 0.0287272 -0.0069135 -0.0010595 -0.0050772 -0.1430313 -0.1569904 -0.0538888 0.0003205 -0.1924927 0.0073709 -0.0016518 0.0037314 -0.0034026 -0.1906917 0.0367474 -0.0253498 0.0015914 0.0862248 0.0341114 0.0008968 -0.0021342 0.003106 0.1193375 0.1515978 -0.0955328 -0.0024455 -0.0932625 0.0990585 -0.0048726 -0.0024097 -0.0047937 -0.1479689 -0.0141605 0.0411111 -0.0032408 0.156356 0.1096611 -0.0091216 -0.0063334 -0.0074484 -0.1445685 -0.0574722 0.0186151 -0.0029464 -0.0772832 -0.0838969 -0.0012194 -0.0003359 -0.0027945 -0.1791838 0.2479033 -0.0297685 0.001522 -0.0364479 0.1175661 0.0048684 0.0018876 0.0040309 0.3225701 -0.0256097 -0.0686701 0.0047565 -0.0925383 0.0495365 0.0044949 0.0052083 0.0041988 0.1872526 0.1149188 -0.0645719 0.002496 -0.0438795 0.0050382 0.0047326 0.0017768 0.0049616 0.1563678 -0.0114814 0.1369051 -0.0004924 0.1151671 -0.0593088 0.0031659 -0.0001139 0.002584 0.1489995 -0.0496628 -0.0488629 0.0037097 -0.1483307 0.0133058 0.004828 0.0059539 0.0033279 0.125056 0.0056813 0.036277 0.0189604 0.1145956 -0.0091657 0.1089772 -0.0707043 0.1324255 -0.0548559 0.0073321 0.0314565 -0.0219254 0.1145684 -0.0210903 -0.1142668 0.0636969 -0.1352036 -0.0444841 -0.0087081 0.0965901 0.0002552 0.1237564 -0.0531216 0.0033497 -0.0004168 0.0037968 0.1551789 0.0323244 -0.07326 0.004017 -0.1080108 -0.0972829 0.0083389 0.0049743 0.0077578 0.1580485 -0.1418534 -0.0222189 0.0058913 -0.0253732 0.0876064 0.0024566 0.0060122 0.0024356 0.1656487 unknown
polarizability: 207.0146376|0.2076404|120.3408129|-2.4728897|-1.664838|52.764039 unknown
InChI: InChI=1S/C10H10N2/c1-8-7-11-10(12-8)9-5-3-2-4-6-9/h2-7,12H,1H3
charge 0 multiplicity 1
22 atoms
N  1.589007 -0.81428 -0.069047
N  1.286867 1.419901 -0.115686
C  0.647695 0.222764 -0.078732
C  -0.806689 0.031649 -0.050828
C  2.875233 -0.255784 -0.100972
C  2.653397 1.127997 -0.129234
C  -1.647858 1.179341 -0.066262
C  -1.408726 -1.256889 -0.008028
C  4.130647 -1.07678 -0.09848
C  -3.04893 1.039281 -0.038813
C  -2.813383 -1.392887 0.019621
C  -3.641183 -0.246692 0.00465
H  1.384168 -1.811878 -0.047179
H  3.400078 1.918744 -0.158213
H  -1.173625 2.165098 -0.099846
H  -0.793881 -2.166175 0.003647
H  5.009238 -0.411934 -0.126785
H  4.218545 -1.703979 0.809623
H  4.194099 -1.747679 -0.976927
H  -3.683022 1.932832 -0.051214
H  -3.261436 -2.392349 0.052879
H  -4.73124 -0.3536 0.026424
