program: Gaussian 09
title: 000070018
version: EM64L-G09RevD.01
frameworkgroup: C1[X(C7H6F3NO2S)]
method: RPBEPBE
basis: SDD
operation: Freq
keyword: #p
keyword: freq=noraman
keyword: PBEPBE/SDD
title: #p freq=noraman PBEPBE/SDD
converged: NO YES NO NO
title: Mulliken charges:
elementType: S F F F O O N C C C C C C C H H H H H H
charge: 0.953807 -0.160053 -0.160068 -0.160964 -0.530345 -0.530546 -0.719028 -0.020363 0.310562 -0.215531 -0.221781 -0.349753 -0.292224 0.273680 0.293319 0.293198 0.279191 0.274055 0.341500 0.341343
chargesum: 0.00000
title: Mulliken charges with hydrogens summed into heavy atoms:
elementType: S F F F O O N C C C C C C C
charge: 0.953807 -0.160053 -0.160068 -0.160964 -0.530345 -0.530546 -0.036184 -0.020363 0.310562 0.077788 0.071417 -0.070562 -0.018169 0.273680
polarizability: 1.51973267e+02 5.06307255e-01 1.14303435e+02 2.82014644e+00 2.98186966e-02 7.25463672e+01
1716.lowfreq: -19.5777 -8.2384 -0.0027 -0.0016 -0.0015 1.4277 5.7309 31.6565 58.0997
frequency: -19.4315 31.6246 58.0971 106.6371 116.1633 136.6214 184.0551 194.9584 226.7061 270.3291 304.2799 332.2076 352.1955 373.0034 379.1962 403.5720 445.0504 462.6402 488.4245 517.3740 570.4272 616.2394 623.7825 720.1754 736.9873 794.4862 805.9138 846.8918 857.6293 909.6160 971.5492 983.0291 985.2260 997.8604 1014.9543 1029.8513 1054.7812 1072.9477 1127.1204 1187.6385 1277.4261 1296.5174 1390.3795 1395.5777 1474.2688 1535.9241 1599.6867 1603.2288 3158.0368 3161.3002 3174.9271 3182.6940 3371.8805 3538.9095
redmass: 9.2354 4.3462 8.1438 9.2338 1.5235 7.0908 10.9540 10.6189 9.0190 2.3455 10.3625 9.0062 9.7950 7.6149 6.7196 2.9155 8.0115 5.9720 4.5518 10.9952 3.6106 7.1048 11.7750 6.6526 3.9884 1.9278 6.1789 1.3663 1.3903 3.9781 1.4363 6.9098 1.7505 4.0086 5.5025 7.0910 2.2569 1.5308 1.3985 1.1262 4.8074 1.2560 6.0971 3.7169 2.3933 1.0849 7.1384 6.5821 1.0890 1.0900 1.0977 1.0968 1.0415 1.1005
irintensity: 0.6738 0.2903 2.4274 2.0601 40.0010 2.5673 0.2940 1.2092 1.4751 4.8218 2.4464 4.3833 60.6726 0.1044 3.0660 0.1715 32.3250 31.9788 130.4395 0.3887 43.5714 0.2364 22.2022 2.7029 0.7347 65.5500 192.7179 31.4900 61.9781 61.6201 13.6716 102.7074 51.5792 155.6389 82.4313 169.0501 9.6700 10.2307 6.8038 0.3109 285.0454 3.8684 16.8443 21.4548 0.3732 24.9039 9.5717 16.3802 1.4748 2.8341 2.2236 0.8888 34.5045 29.5368
temp: 298.150 k
press: 1.00000 atm
elementType: 16 9 9 9 8 8 7 6 6 6 6 6 6 6 1 1 1 1 1 1
symmnumber: 1
zpe: 325689.3 jmol-1
zpe.correction: 0.124049 hartree
zpe.thermalcorrener: 0.137287 hartree
zpe.thermalcorrenthalpy: 0.138231 hartree
zpe.thermalcorrgfe: 0.083313 hartree
zpe.sumelectzpe: -1171.916413 hartree
zpe.sumelectthermal: -1171.903174 hartree
zpe.sumelectthermalent: -1171.902230 hartree
zpe.sumelectthermalfe: -1171.957149 hartree
dipole: 0.8477 0.1072 2.9494
dipole: 3.0707
quadrupole: -101.7961 -83.5713 -91.5748
quadrupole: -0.4462 15.3298 -0.0410
quadrupole: -9.4820 8.7427 0.7393 -0.4462 15.3298 -0.0410
hfenergy: -1172.0404612 hartree
pointgroup: C01 [X(C7H6F3N1O2S1)]
dipole: 0.3075328 0.0438799 1.1674665 debye
dipolederiv: 2.0695931 -0.0028814 0.2536406 -0.0022788 1.1897566 -0.0025082 0.2093281 -0.0017492 1.593069 -0.5935019 0.2275528 -0.0080858 0.2042794 -0.6759458 0.0090316 0.0001671 0.0054099 -0.2835345 -0.6750742 -0.110116 -0.1930728 -0.174158 -0.3787032 -0.2112712 -0.2059285 -0.1785223 -0.6213144 -0.6760686 -0.101675 0.1839849 -0.1652672 -0.3671715 0.20016 0.2158953 0.1727861 -0.6342009 -0.7381308 0.054679 -0.0216198 0.086528 -0.5974278 -0.1721435 -0.0269381 0.003435 -0.5394456 -0.7385794 -0.0554422 -0.0204529 -0.0863549 -0.5987138 0.1720928 -0.0271957 -0.0036211 -0.5383651 -0.716459 0.001029 -0.0744487 0.0021487 -0.3662247 0.003096 -0.1551842 0.003095 -0.8980269 0.0734432 0.0001878 0.0497502 0.0015903 -0.0396683 -0.0003962 0.1398562 -0.0011274 -0.1491272 -0.3913692 0.002153 -0.0094446 0.0434149 -0.004774 0.0001974 -0.0018837 -0.0003317 -0.1468465 -0.2839601 0.1973085 -0.0216924 -0.1158805 -0.0472684 0.002744 -0.014624 -0.0219747 -0.0766863 -0.2828552 -0.1966744 -0.0215976 0.1188403 -0.0462627 -0.0027144 -0.0145946 0.0220878 -0.0771319 0.0235827 -0.1741804 0.0020545 0.1157982 0.0122289 0.0007086 -0.0144358 -0.0018807 -0.0858818 0.0196838 0.1800433 0.0019198 -0.0911031 0.0258935 -0.0003445 -0.0126135 0.0028743 -0.0819539 2.2172933 -0.0161422 0.0199233 0.0735985 1.3538778 0.0016149 -0.0070726 0.0002649 1.5471578 0.1187955 -0.0594854 0.007013 -0.0327342 0.0807944 -0.0041226 0.0014511 0.0070147 0.1553487 0.1184456 0.0611486 0.0070007 0.0317909 0.0800999 0.004132 0.0012874 -0.0070951 0.1554955 0.0586592 0.0458568 -0.0002278 0.039188 0.0363493 0.0013956 0.0032981 0.0020963 0.1628287 0.0334657 -0.0541048 -0.000583 -0.0495791 0.0307322 -0.0015063 0.0030317 -0.002506 0.1589274 0.1814933 0.0654191 -0.076691 0.0204032 0.1571316 -0.1021659 -0.0469813 -0.0519024 0.1789746 0.1815431 -0.0646761 -0.0773705 -0.0202246 0.155296 0.1019999 -0.0468628 0.0516467 0.1807133 unknown
polarizability: 151.8064571|0.5796094|114.3054999|4.5836545|0.0095076|72.7111121 unknown
InChI: InChI=1S/C7H6F3NO2S/c8-7(9,10)5-1-3-6(4-2-5)14(11,12)13/h1-4H,11H2
charge 0 multiplicity 1
20 atoms
S  3.147771 -0.001095 -0.056076
F  -3.581282 1.287437 -0.033442
F  -3.54213 -0.699839 -1.130727
F  -3.531239 -0.660598 1.130658
O  3.615614 -1.437841 -0.661901
O  3.627985 1.437341 -0.648121
N  3.578953 -0.01243 1.727805
C  1.259757 0.007011 -0.024889
C  -1.503715 0.020192 -0.021243
C  0.607031 1.247687 -0.031509
C  0.595686 -1.230088 -0.031807
C  -0.804752 1.24796 -0.02899
C  -0.81377 -1.217069 -0.029472
C  -3.009523 -0.001571 -0.014888
H  1.181093 2.178783 -0.062275
H  1.161433 -2.166159 -0.063002
H  -1.355189 2.192502 -0.035677
H  -1.370035 -2.15932 -0.037567
H  4.10466 -0.878409 1.93138
H  4.106853 0.849606 1.942143
