program: Gaussian 09
title: 000070004
version: EM64L-G09RevD.01
frameworkgroup: C1[X(C12H10)]
method: RPBEPBE
basis: SDD
operation: Freq
keyword: #p
keyword: freq=noraman
keyword: PBEPBE/SDD
title: #p freq=noraman PBEPBE/SDD
converged: YES YES NO NO
title: Mulliken charges:
elementType: C C C C C C C C C C C C H H H H H H H H H H
charge: 0.192371 0.404211 0.299003 -0.372400 -0.444827 -0.423883 -0.409290 -0.249952 -0.253706 -0.244899 -0.180708 -0.574838 0.226494 0.238274 0.236905 0.237084 0.226726 0.226868 0.228619 0.205031 0.214608 0.218309
chargesum: 0.00000
title: Mulliken charges with hydrogens summed into heavy atoms:
elementType: C C C C C C C C C C C C
charge: 0.192371 0.404211 0.299003 -0.145907 -0.206553 -0.186978 -0.172206 -0.023226 -0.026838 -0.016280 0.024323 -0.141921
polarizability: 1.97101510e+02 9.80502184e-01 1.51136104e+02 2.88873694e+00 1.12566544e+00 5.27266192e+01
1716.lowfreq: -8.8204 -4.4037 -0.0005 -0.0004 0.0004 12.0383 75.8382 116.2325 178.0028
frequency: 75.8305 116.2295 178.0024 204.2183 243.8967 340.4928 402.8705 432.2885 471.4595 485.4364 504.1692 530.4670 595.8421 619.5189 698.6325 702.5745 745.7285 785.7760 791.4894 817.7809 848.4955 881.9063 920.0106 931.8900 961.3541 981.5970 989.5203 992.3104 1007.0642 1027.7909 1037.3183 1098.6581 1150.7067 1175.9091 1186.4926 1234.1163 1245.0074 1271.9083 1312.3891 1361.9075 1404.6254 1413.6655 1430.4554 1441.6566 1456.5072 1515.8812 1585.2964 1592.1678 1627.6875 1636.8099 3095.2456 3109.6832 3121.0531 3123.1218 3132.8800 3137.7678 3151.4539 3158.1983 3165.7896 3203.3748
redmass: 2.7992 2.7940 3.8846 3.4556 2.5183 3.9223 2.7991 4.5276 3.1518 5.1607 2.7335 5.4198 3.6864 2.7846 2.9689 2.3879 1.4219 5.2795 1.6370 1.6398 4.3186 1.8776 1.4249 1.3539 1.3842 1.3072 1.2235 1.3581 3.5043 1.7912 2.1182 1.8432 1.4063 1.0908 1.2159 2.0041 1.7463 1.8966 1.3802 2.0903 2.5986 5.3627 1.5863 1.9999 2.3238 3.6428 7.3000 5.2140 5.9032 4.6331 1.0607 1.0903 1.0862 1.0858 1.0890 1.0914 1.0943 1.0990 1.0991 1.1144
irintensity: 0.1867 0.0415 2.2386 1.0817 4.2162 1.2777 7.0572 2.9110 0.0310 1.8913 4.1523 1.1698 3.9053 4.2362 5.5477 9.3082 1.2576 1.3145 90.4744 42.0975 0.3038 9.2441 1.3570 70.8001 1.9039 1.9656 19.9779 1.3918 8.4872 6.6166 3.7380 3.3135 2.9515 2.0369 2.7464 4.4694 4.5410 0.1135 1.3084 14.3188 1.1823 1.5325 3.6096 9.5501 2.1829 7.1657 0.2964 3.6046 4.3813 10.1064 8.8079 9.9004 1.3966 0.5831 6.6271 18.1807 36.5900 34.4238 22.9279 22.8367
temp: 298.150 k
press: 1.00000 atm
elementType: 6 6 6 6 6 6 6 6 6 6 6 6 1 1 1 1 1 1 1 1 1 1
symmnumber: 1
zpe: 465720.4 jmol-1
zpe.correction: 0.177384 hartree
zpe.thermalcorrener: 0.186752 hartree
zpe.thermalcorrenthalpy: 0.187696 hartree
zpe.thermalcorrgfe: 0.142736 hartree
zpe.sumelectzpe: -462.447013 hartree
zpe.sumelectthermal: -462.437645 hartree
zpe.sumelectthermalent: -462.436701 hartree
zpe.sumelectthermalfe: -462.481661 hartree
dipole: -0.1545 0.0555 -0.0315
dipole: 0.1672
quadrupole: -60.8291 -60.4603 -77.0112
quadrupole: 0.0441 0.1759 1.1494
quadrupole: 5.2711 5.6399 -10.9110 0.0441 0.1759 1.1494
hfenergy: -462.6243967 hartree
pointgroup: C01 [X(C12H10)]
dipole: 0.0591041 0.0254504 0.0136207 debye
dipolederiv: 0.0389925 -0.1210171 0.0022867 -0.1622548 -0.069868 -0.0035055 0.0362888 0.0229137 -0.0055016 0.0319276 -0.0801068 0.0095547 -0.1221775 -0.0735606 0.0014191 0.0099897 0.0072062 0.0651556 0.1406191 0.0947501 -0.0150549 0.0880712 -0.0051475 0.0371712 0.0307333 0.0587004 0.0033249 -0.064766 0.0713182 0.0056231 0.0388153 0.0487463 -0.0043734 0.0001528 -0.0057768 -0.1537541 -0.013566 0.083061 -0.0029466 -0.0265738 0.0309372 -0.0271692 0.0037539 -0.0197986 -0.1846314 0.0375907 0.0533711 -0.000768 0.1237279 0.0683582 -0.0190076 -0.0051151 -0.0210113 -0.1742454 0.0382917 0.0336699 -0.0336034 -0.0266972 -0.1130458 -0.013787 -0.031372 -0.0141101 -0.1576028 -0.1057349 -0.0758275 0.0023259 0.0024368 0.1470545 -0.0225638 0.0062001 -0.022774 -0.1457014 -0.080929 -0.0392426 -0.0003033 0.001423 0.1455217 -0.0202047 0.0031002 -0.0167975 -0.1625212 0.1245258 0.0512874 0.0023745 0.0327865 -0.0884588 -0.0045883 -0.0017269 -0.009224 -0.1639666 0.1073292 0.0772024 0.0950528 0.2532371 0.2060351 -0.0901808 -0.0097146 -0.1470743 -0.0723115 -0.2915014 -0.0704558 0.0909021 -0.0676242 -0.0364645 -0.1998688 0.0455709 -0.2001348 -0.2589108 0.045278 -0.1117174 0.0041242 -0.0682538 -0.0445672 0.0047464 -0.0073629 0.0037846 0.1468111 0.0055931 -0.1259068 0.0082702 -0.0585952 -0.0410553 0.0160879 -0.0023065 0.0158586 0.1554816 0.0167731 -0.052535 0.0010131 -0.1263662 -0.0587901 0.0149263 0.0060116 0.0184124 0.1535601 -0.1116643 0.033631 0.0094103 -0.0006714 0.0893627 0.0068175 0.0102076 0.0104173 0.1422587 0.044912 0.0910216 -0.0089588 0.0715326 -0.1047159 0.0237219 0.0009817 0.0242577 0.1561173 0.0363063 0.0828513 -0.0091995 0.0988843 -0.0942497 0.0209228 -0.0036554 0.0216524 0.1584853 -0.1492989 0.0201929 -0.0096372 0.0236503 0.0894928 0.0058281 -0.0087042 0.0049032 0.1618895 0.0589524 0.0743292 -0.0720618 -0.0120041 -0.0493714 0.0927151 -0.0353226 0.0988529 0.0857331 0.0003191 -0.1051921 -0.0201924 -0.1184137 -0.0263887 0.0590752 0.0156903 0.0729472 0.1520824 0.09005 0.015315 -0.0582119 0.0550671 -0.0198252 0.1218179 -0.0634009 0.0967947 0.0982473 unknown
polarizability: 196.4280977|1.7732455|150.4917764|10.162357|-7.9677279|54.0443594 unknown
InChI: InChI=1S/C12H10/c1-2-10-7-5-8-11-6-3-4-9-12(10)11/h2-9H,1H2
charge 0 multiplicity 1
22 atoms
C  0.165338 -0.343651 0.049857
C  1.004917 0.837723 -0.041939
C  -1.279012 -0.190503 0.014344
C  0.812992 -1.621857 0.153315
C  0.399838 2.129196 -0.182343
C  2.432364 0.695815 -0.00012
C  -1.819479 1.103196 -0.117781
C  -0.990022 2.256413 -0.225262
C  2.205887 -1.729664 0.189868
C  3.026861 -0.560916 0.117726
C  -2.1728 -1.365192 0.145446
C  -3.443791 -1.461928 -0.335217
H  0.210829 -2.535031 0.18718
H  1.044494 3.013498 -0.250641
H  3.051359 1.598706 -0.066766
H  -2.90746 1.229981 -0.101716
H  -1.451662 3.245058 -0.323173
H  2.675266 -2.716641 0.268869
H  4.11759 -0.658433 0.148467
H  -1.771962 -2.228988 0.692764
H  -4.047045 -2.359248 -0.161369
H  -3.9085 -0.664234 -0.92671
