program: Gaussian 16
title: Title
version: ES64L-G16RevC.01
frameworkgroup: C1[X(C15H24O3)]
method: RB3LYP
basis: 6-31+G(d,p)
operation: Freq
keyword: #N
keyword: Geom=AllCheck
keyword: Guess=TCheck
keyword: SCRF=Check
keyword: GenChk
keyword: RB3LYP/6-31+G(d,p)
keyword: Freq
converged: YES YES YES YES
title: Mulliken charges:
elementType: C C C C C C C H H H H C H C C C H C H H O H H H H C H H H H H C H H O H O H C H H H
charge: -0.528041 -0.156890 -1.136926 0.348488 0.666234 -0.233658 -0.085859 0.150375 0.137749 0.133797 0.137532 -0.557466 0.142714 0.297798 -0.093766 -0.455514 0.148766 0.132806 0.125062 0.131360 -0.488837 0.395210 0.139304 0.146746 0.165403 -0.359723 0.158460 0.155854 0.148769 0.138523 0.138794 -0.090065 0.138016 0.140279 -0.580281 0.391362 -0.471784 0.371341 -0.407498 0.161702 0.145589 0.158275
chargesum: -0.00000
title: Mulliken charges with hydrogens summed into heavy atoms:
elementType: C C C C C C C C C C C C O C C O O C
charge: -0.239917 -0.023093 -1.136926 0.348488 0.803766 -0.094863 0.052665 -0.249349 0.444544 -0.093766 -0.167444 0.389227 -0.093627 0.103360 0.188231 -0.188919 -0.100444 0.058068
chargesum: 0.00000
1716.lowfreq: -9.3033 -4.3076 -0.0010 -0.0008 -0.0001 7.1304 87.8008 98.6240 126.1680
frequency: 87.7796 98.6055 126.1612 133.5333 171.9931 183.1966 214.9806 232.6287 236.0059 269.7390 276.5081 284.1399 297.7029 317.6202 322.7795 345.6550 351.2412 378.8418 390.6561 398.9573 411.9293 446.3063 459.5253 472.8080 511.2482 523.6775 555.7246 587.5033 604.1974 632.8298 655.3447 692.3124 707.9139 728.3186 769.7256 809.1479 852.3546 866.8150 887.0494 902.1703 909.6951 914.8473 937.0567 944.4556 953.4961 975.0116 987.2023 998.5249 1003.9118 1016.0677 1034.3947 1044.9037 1051.6293 1065.3707 1076.7034 1105.9084 1117.8611 1130.5284 1146.3702 1158.2197 1180.3862 1189.0175 1189.4137 1216.2165 1223.6786 1226.4309 1249.7469 1270.1969 1279.8801 1285.3558 1292.4735 1308.0323 1328.5050 1331.6529 1336.9626 1347.2754 1365.2074 1371.5581 1376.8245 1390.1842 1407.7464 1413.0272 1415.1410 1431.0426 1447.7252 1458.8629 1491.8705 1495.6716 1497.2376 1501.1195 1502.4187 1515.0725 1529.0339 1539.7556 1541.5125 1733.6143 2987.6555 3007.5765 3024.6045 3037.0521 3041.4281 3043.4736 3049.4462 3051.4743 3059.1106 3062.7854 3082.9200 3089.3378 3092.6037 3094.9197 3103.1514 3107.8708 3124.7208 3141.3888 3153.9616 3167.9425 3173.6285 3653.3837 3795.0967 3826.4355
redmass: 5.1186 4.6351 4.0316 4.5995 3.6832 2.1946 1.2666 1.7992 1.5735 2.9795 1.8012 2.8887 1.8497 3.9411 2.4586 2.8648 3.2268 1.2673 2.7726 1.9281 2.9548 2.8201 2.8807 2.9189 3.2419 2.7234 2.1890 3.5236 3.0151 1.3647 3.1012 3.3996 3.1122 2.6932 2.1312 2.9438 2.6069 2.4211 2.4049 2.0668 2.1805 2.3118 2.1242 3.5475 2.1399 1.8770 1.5887 2.3784 1.4566 1.9383 2.5239 3.0349 2.8699 2.6002 2.6806 2.6596 2.0029 2.0569 1.6513 1.7937 2.2667 1.9752 1.9544 1.2693 1.3778 1.2789 1.1670 1.4122 1.4305 1.5204 1.3676 1.3663 1.4625 1.4141 1.4854 1.3744 1.2186 1.4355 1.3889 1.2269 1.3846 1.2357 1.3220 1.4559 1.3329 1.1984 1.0538 1.0608 1.0499 1.0644 1.0694 1.0789 1.0690 1.0861 1.0732 7.2563 1.0761 1.0634 1.0356 1.0444 1.0645 1.0843 1.0760 1.0727 1.0959 1.0769 1.1017 1.0863 1.1023 1.1006 1.1019 1.0968 1.0913 1.0851 1.0974 1.0967 1.0868 1.0661 1.0664 1.0669
irintensity: 2.8182 5.3368 2.0227 1.7853 7.4448 28.7676 140.8803 37.2729 1.8712 3.9713 0.4115 11.0253 2.4907 2.0641 5.0204 2.6764 1.6320 120.4209 19.0317 35.2052 2.7961 4.9022 8.2968 8.1650 13.6722 0.7748 7.8243 21.3290 14.0402 138.6347 15.0073 44.4801 16.2390 9.5194 33.7217 18.7324 4.4996 32.6870 23.0958 9.4132 21.3113 3.3284 8.2447 132.0386 13.3334 7.9531 9.5474 53.7966 4.9057 25.5521 33.3523 72.7728 69.9858 26.6987 137.8879 2.4340 17.7075 10.7124 5.0985 21.3499 0.4429 8.6650 5.0127 11.7864 14.8332 78.4308 5.0539 9.6979 5.9061 4.0159 3.7192 7.3282 4.9401 6.0134 0.8113 2.0540 31.6195 1.0399 9.4754 45.0312 9.8132 3.4362 22.2604 5.5445 5.0095 102.8629 7.9172 7.5814 4.3531 8.4993 0.5621 17.0049 26.1986 10.2632 21.2460 12.0946 101.3396 71.9431 51.6087 69.4968 52.4674 53.1982 27.5793 69.0047 100.3465 151.2207 50.3472 32.0998 50.7710 66.8340 62.1976 49.4313 26.1097 18.0987 25.2324 60.2275 44.7922 334.7178 42.7829 66.6524
temp: 298.150 k
press: 1.00000 atm
elementType: 6 6 6 6 6 6 6 1 1 1 1 6 1 6 6 6 1 6 1 1 8 1 1 1 1 6 1 1 1 1 1 6 1 1 8 1 8 1 6 1 1 1
symmnumber: 1
zpe: 983447.6 jmol-1
zpe.correction: 0.374575 hartree
zpe.thermalcorrener: 0.391274 hartree
zpe.thermalcorrenthalpy: 0.392219 hartree
zpe.thermalcorrgfe: 0.333407 hartree
zpe.sumelectzpe: -811.418633 hartree
zpe.sumelectthermal: -811.401934 hartree
zpe.sumelectthermalent: -811.400990 hartree
zpe.sumelectthermalfe: -811.459802 hartree
dipole: 0.6898 5.7297 2.2162
dipole: 6.1820
quadrupole: -107.9142 -123.0383 -110.5065
quadrupole: 3.1128 2.3473 -5.3628
quadrupole: 5.9055 -9.2186 3.3132 3.1128 2.3473 -5.3628
hfenergy: -811.7932089 hartree
pointgroup: C01[X(C15H24O3)]
dipole: 0.2110133 2.2603715 0.8727168 debye
polarizability: 242.545236|4.1396308|252.3808967|2.307299|0.6511067|218.4073898 unknown
InChI: InChI=1/15C.3O.24H
charge 0 multiplicity 1
42 atoms
C  -0.40696158 1.47048263 1.46383693
C  -0.20565594 -0.06715981 1.63938614
C  -0.6567953 -0.88350117 0.38506209
C  -0.73577322 1.93768571 0.01054721
C  -2.15922733 -0.74826072 -0.0342061
C  -2.23125718 1.77302774 -0.16997354
C  -2.83741294 0.58530039 -0.1678456
H  -1.20976572 1.8243536 2.11805856
H  0.50046882 1.98159478 1.80329525
H  -0.70801398 -0.40645314 2.55234476
H  -2.73184405 -1.31535932 0.70878703
C  0.00421089 1.08511658 -1.07568402
H  -0.65574961 1.0105458 -1.94667944
C  0.40550919 -0.34114599 -0.62521965
C  1.76766281 -0.40303473 0.18111708
C  1.31393634 -0.37008825 1.68016952
H  1.52855502 -1.32155536 2.17360363
C  -0.4958345 -2.4082792 0.68859615
H  -1.31887294 -2.70804317 1.35547708
H  0.42505796 -2.62432334 1.22239943
O  -0.47152163 -3.24280643 -0.47178208
H  -1.20705764 -2.94008283 -1.03491301
H  1.85024677 0.39117983 2.25678272
H  0.481097 -0.97911853 -1.50961434
H  0.8872151 1.61532628 -1.43447273
C  -0.36965984 3.42282934 -0.14969972
H  -0.63998608 3.78404175 -1.14890788
H  -0.89740189 4.03957804 0.58752294
H  0.70552104 3.57873783 -0.0133217
H  -3.9171101 0.52047492 -0.28879775
H  -2.83088362 2.67727701 -0.27048591
C  2.70979182 0.79087056 -0.04781091
H  2.22731437 1.73222987 0.24115061
H  3.58738381 0.66088904 0.60153844
O  3.12379991 0.8477307 -1.42200093
H  3.73109639 1.59156968 -1.52908818
O  -2.40212159 -1.50431306 -1.26854473
H  -2.1209755 -0.95369574 -2.01436005
C  2.5628589 -1.6786893 -0.17189556
H  2.95503508 -1.60868701 -1.19047455
H  3.41293942 -1.7957131 0.51120495
H  1.95021556 -2.57875892 -0.11568615
