program: Gaussian 16
title: Title
version: ES64L-G16RevC.01
frameworkgroup: C1[X(C15H24O3)]
method: RB3LYP
basis: 6-31+G(d,p)
operation: Freq
keyword: #N
keyword: Geom=AllCheck
keyword: Guess=TCheck
keyword: SCRF=Check
keyword: GenChk
keyword: RB3LYP/6-31+G(d,p)
keyword: Freq
converged: YES YES YES YES
title: Mulliken charges:
elementType: C C C C C C C H H H H C H C C C H C H H O H H H H C H H H H H C H H O H O H C H H H
charge: -0.541017 -0.117427 -1.074683 0.347094 0.556432 -0.259518 -0.057144 0.152017 0.139793 0.135762 0.138855 -0.489649 0.147976 0.112662 -0.087938 -0.313191 0.150654 0.113178 0.125046 0.132130 -0.490276 0.395137 0.126259 0.149374 0.142392 -0.353975 0.157522 0.150025 0.160377 0.139855 0.139891 -0.199955 0.146196 0.139677 -0.486368 0.353593 -0.476724 0.370972 -0.340816 0.144513 0.161006 0.160295
chargesum: -0.00000
title: Mulliken charges with hydrogens summed into heavy atoms:
elementType: C C C C C C C C C C C C O C C O O C
charge: -0.249207 0.018335 -1.074683 0.347094 0.695287 -0.119627 0.082711 -0.199281 0.262036 -0.087938 -0.036278 0.370354 -0.095140 0.113949 0.085918 -0.132775 -0.105752 0.124997
chargesum: 0.00000
1716.lowfreq: -1.3154 -0.0008 0.0008 0.0010 5.0454 8.5320 85.3863 95.8920 128.5858
frequency: 85.3533 95.8771 128.5786 137.5124 161.8809 199.5355 227.3020 232.3194 257.1652 276.9464 284.4470 292.1607 294.8141 317.9334 325.7039 330.9804 357.2577 373.3832 384.8125 405.4046 410.3034 434.1084 452.2374 472.6442 514.0299 522.3227 550.5467 582.3110 623.8193 632.2031 663.2168 682.6733 701.1334 736.6105 770.7143 805.6148 848.3692 868.6789 881.0482 895.0512 914.3369 929.8721 938.6276 946.6108 953.0280 967.2557 984.6937 993.5083 1003.3722 1019.8826 1029.9931 1035.9905 1050.8058 1065.6111 1078.0548 1106.8605 1116.7233 1130.8418 1136.4630 1157.8348 1174.3682 1181.8479 1190.8969 1212.0839 1225.3963 1243.4936 1249.7179 1263.3020 1276.8808 1283.9839 1297.0057 1326.4622 1332.1806 1334.2402 1345.6398 1366.9393 1372.0600 1376.2836 1389.2954 1391.2805 1408.2334 1411.5635 1416.0267 1426.9557 1431.8064 1459.0117 1491.2528 1495.5860 1496.8499 1498.3225 1500.2593 1511.1800 1526.4318 1530.8805 1540.6599 1734.0389 2990.6869 3026.1022 3038.0976 3040.9025 3043.5294 3046.0159 3047.8871 3054.8546 3060.5547 3083.8878 3084.9180 3094.1218 3094.8057 3099.6748 3103.1430 3106.9086 3107.2440 3143.4075 3154.1802 3169.6616 3175.1759 3653.8715 3797.3516 3812.0835
redmass: 5.1712 5.0142 3.8769 4.0342 3.3662 2.0238 2.6669 1.3363 3.0239 1.8990 1.8397 1.3006 2.8249 3.8869 2.7391 2.3901 2.6707 1.4859 1.9160 2.8999 2.3919 2.7062 2.9710 2.9742 3.3771 2.8262 2.1190 3.2297 1.5763 2.2804 3.6623 2.4812 4.1424 2.5352 2.2755 2.8396 2.5050 2.6321 2.3632 2.2034 2.3654 1.8873 2.3507 2.5850 2.4071 1.6994 1.7656 2.3646 1.4298 1.9666 4.4093 2.3664 2.6027 2.6112 2.6693 2.7089 1.9942 1.9055 1.8377 1.5982 2.2759 1.9461 2.1833 1.2005 1.3979 1.3291 1.1856 1.6185 1.5982 1.3931 1.6081 1.4542 1.4002 1.5174 1.3440 1.2183 1.3670 1.3882 1.2140 1.2221 1.2610 1.3160 1.3631 1.2208 1.4299 1.1965 1.0584 1.0640 1.0532 1.0544 1.0634 1.0799 1.0741 1.0689 1.0852 7.2525 1.0759 1.0356 1.0482 1.0616 1.0616 1.0843 1.0671 1.0723 1.0819 1.0933 1.0924 1.1023 1.0981 1.1056 1.0973 1.0962 1.0984 1.0852 1.0986 1.0967 1.0869 1.0660 1.0664 1.0661
irintensity: 2.3226 6.0832 2.0436 3.7232 5.8343 14.3097 0.5349 0.4909 2.3299 15.5520 21.6252 110.2741 28.6058 8.1187 4.4371 7.0521 13.9927 152.6666 22.9691 7.2442 2.2368 8.9629 0.0500 11.3497 9.3999 0.7935 4.9697 13.3674 117.0854 49.0446 0.5615 67.4515 1.1887 12.7346 28.4011 17.7100 2.7596 33.7654 17.6121 16.8854 6.8058 10.6508 97.7560 49.3159 27.5624 14.5458 11.3607 24.5521 6.1783 30.6476 158.6239 53.0755 32.8540 21.8588 139.2841 10.2742 8.6358 1.8299 3.9108 54.8470 2.9739 2.2672 1.3527 7.0097 19.3484 20.7632 9.1983 4.4821 13.4749 5.0358 11.3533 9.0025 5.3577 0.6081 2.0364 25.4964 5.0490 16.2227 21.1726 36.2385 36.4994 6.2469 26.5387 9.7995 2.0535 98.4288 2.3920 7.8070 2.6366 2.0018 21.9503 11.1937 5.0719 29.5491 9.6945 11.3604 104.4653 47.3322 53.0155 37.1746 83.3881 54.7689 63.5777 86.9718 94.4044 87.8111 19.7576 46.7869 52.8484 64.5367 21.6256 67.3977 90.1400 16.9655 27.3845 57.3999 41.9391 335.1480 42.2897 38.8709
temp: 298.150 k
press: 1.00000 atm
elementType: 6 6 6 6 6 6 6 1 1 1 1 6 1 6 6 6 1 6 1 1 8 1 1 1 1 6 1 1 1 1 1 6 1 1 8 1 8 1 6 1 1 1
symmnumber: 1
zpe: 984041.3 jmol-1
zpe.correction: 0.374802 hartree
zpe.thermalcorrener: 0.391443 hartree
zpe.thermalcorrenthalpy: 0.392387 hartree
zpe.thermalcorrgfe: 0.333685 hartree
zpe.sumelectzpe: -811.417195 hartree
zpe.sumelectthermal: -811.400554 hartree
zpe.sumelectthermalent: -811.399610 hartree
zpe.sumelectthermalfe: -811.458312 hartree
dipole: -1.9570 4.5895 1.8439
dipole: 5.3191
quadrupole: -125.2001 -125.8424 -105.2957
quadrupole: -4.4221 6.5294 -2.7186
quadrupole: -6.4207 -7.0630 13.4837 -4.4221 6.5294 -2.7186
hfenergy: -811.7919967 hartree
pointgroup: C01 [X(C15H24O3)]
dipole: -0.8114571 1.7890512 0.7212317 debye
polarizability: 244.8102163|3.9440333|251.2023668|0.4839496|-0.997736|216.01884 unknown
InChI: InChI=1/15C.3O.24H
charge 0 multiplicity 1
42 atoms
C  -0.24537064 1.54980926 1.31205813
C  -0.03213065 0.01965501 1.54202512
C  -0.6565114 -0.85284005 0.40588055
C  -0.78546449 1.94650567 -0.0990194
C  -2.20441235 -0.72480125 0.20511769
C  -2.29170903 1.78718124 -0.04627517
C  -2.89268685 0.60680369 0.10701634
H  -0.93873437 1.95034646 2.05784482
H  0.70577756 2.06502616 1.48456025
H  -0.4065952 -0.26457853 2.53180069
H  -2.65963753 -1.24786908 1.05398975
C  -0.22062568 1.02942526 -1.23797576
H  -1.00839096 0.90170473 -1.98745797
C  0.25350025 -0.36796378 -0.76785521
C  1.71673672 -0.39321959 -0.1571428
C  1.47618034 -0.30056205 1.38840244
H  1.75017728 -1.23244762 1.88910279
C  -0.45400074 -2.36365386 0.75224131
H  -1.17004685 -2.62653447 1.54588832
H  0.53540974 -2.56274897 1.15343077
O  -0.60116475 -3.24884558 -0.36019245
H  -1.41326961 -2.96888669 -0.82052348
H  2.08228875 0.47824979 1.86474008
H  0.21265228 -1.05322778 -1.61900462
H  0.58243283 1.54620469 -1.76786605
C  -0.44459369 3.41809265 -0.38751559
H  -0.85522081 4.07457758 0.38863937
H  0.63884059 3.57194139 -0.42132815
H  -0.8617515 3.73164107 -1.35159386
H  -3.97832968 0.54618979 0.15286322
H  -2.89725995 2.69121714 -0.10128299
C  2.58928685 0.79256386 -0.63052651
H  2.65323165 0.80194509 -1.72316016
H  2.16589584 1.7493379 -0.30652518
O  3.95087256 0.70584851 -0.18339912
H  3.96698892 0.75399237 0.78247372
O  -2.63075635 -1.53999471 -0.93785085
H  -2.48097852 -1.02527248 -1.74461114
C  2.45136148 -1.68584291 -0.57309455
H  2.70545924 -1.64772389 -1.63927274
H  3.383468 -1.79866364 -0.01253525
H  1.83981874 -2.57494539 -0.41745435
