program: Gaussian 16
title: Title
version: ES64L-G16RevC.01
frameworkgroup: C1[X(C15H24O3)]
method: RB3LYP
basis: 6-31+G(d,p)
operation: Freq
keyword: #N
keyword: Geom=AllCheck
keyword: Guess=TCheck
keyword: SCRF=Check
keyword: GenChk
keyword: RB3LYP/6-31+G(d,p)
keyword: Freq
converged: YES YES NO YES
title: Mulliken charges:
elementType: C C C C C C C H H H H C H C C C H C H H O H H H H C H H H H H C H H O H O H C H H H
charge: -0.544115 0.038892 -1.184242 0.324982 0.851746 -0.254963 -0.128961 0.150627 0.138493 0.134844 0.132817 -0.540466 0.160409 0.154059 -0.110413 -0.304009 0.149593 0.018982 0.122177 0.131696 -0.510007 0.396075 0.125402 0.141762 0.137921 -0.372168 0.149160 0.159803 0.156167 0.134264 0.137607 -0.193560 0.145625 0.139208 -0.486626 0.353090 -0.588942 0.405695 -0.337187 0.143877 0.159940 0.160745
chargesum: 0.00000
title: Mulliken charges with hydrogens summed into heavy atoms:
elementType: C C C C C C C C C C C C O C C O O C
charge: -0.254996 0.173736 -1.184242 0.324982 0.984563 -0.117355 0.005303 -0.242136 0.295820 -0.110413 -0.029013 0.272855 -0.113932 0.092961 0.091274 -0.133535 -0.183247 0.127374
1716.lowfreq: -1.3241 0.0004 0.0005 0.0007 5.9536 9.3610 77.3823 89.6096 127.9353
frequency: 77.3755 89.5755 127.9318 136.1442 161.8182 199.0541 225.8947 233.6813 258.6780 276.0592 284.6606 289.8298 292.8801 297.3776 319.7316 326.2512 333.7515 360.4171 381.7061 403.8565 409.4335 434.0865 452.1484 469.3017 513.8786 523.8054 550.9664 584.1106 604.6455 631.0815 663.1930 675.7551 701.9255 735.5437 768.7200 809.5941 847.8228 872.9333 884.2317 901.5393 916.0530 931.0199 937.9722 947.1183 953.9299 967.0160 986.3226 993.2831 1001.7904 1018.6336 1029.0638 1035.3604 1052.3602 1060.5814 1078.2750 1103.2142 1120.1181 1131.2686 1136.0113 1150.3773 1164.5987 1181.7099 1187.6976 1206.6351 1232.4689 1245.5817 1258.2240 1263.3430 1275.2430 1283.4947 1305.1167 1325.7819 1328.5198 1337.2349 1345.3529 1354.0324 1368.9865 1378.0758 1381.2416 1388.5072 1409.2305 1414.6177 1426.2499 1427.0988 1434.9608 1461.1953 1490.7091 1495.5147 1496.4102 1497.9548 1499.9229 1509.6570 1522.8251 1529.6896 1540.2368 1737.0284 2987.7356 3002.8004 3025.1941 3037.3465 3040.1476 3043.9776 3047.9235 3059.8697 3069.7624 3083.0679 3092.8265 3093.2222 3095.0072 3099.9385 3103.3421 3105.7296 3107.4807 3134.9824 3153.6083 3158.7613 3173.2189 3648.7467 3807.6655 3811.9443
redmass: 5.2047 4.4024 4.1550 3.9604 3.3861 2.0288 2.7067 1.3244 2.9427 1.6681 1.5631 1.2312 2.5589 1.8068 3.1904 2.2006 2.8782 3.2903 2.6872 2.8489 2.4057 2.7097 2.9832 2.7773 3.3963 2.9491 2.1126 3.2643 1.2702 2.9355 3.7839 2.8502 4.2314 2.4275 2.3672 3.0326 2.4771 2.4569 2.3950 2.3589 2.2946 1.8542 2.5517 2.6106 2.3404 1.7121 1.8392 2.3170 1.4383 1.9473 4.5072 2.3074 2.7970 2.4044 2.8489 2.1727 2.2695 1.9485 1.8853 1.8312 1.5926 1.9331 2.2671 1.2212 1.2131 1.3627 1.3127 1.5948 1.5764 1.3928 1.4669 1.4348 1.3502 1.6161 1.3474 1.2640 1.3604 1.2709 1.4249 1.2309 1.2243 1.2979 1.2627 1.5038 1.3719 1.1974 1.0594 1.0642 1.0525 1.0564 1.0627 1.0802 1.0724 1.0683 1.0870 7.1166 1.0780 1.0813 1.0356 1.0475 1.0620 1.0630 1.0662 1.0819 1.0652 1.1005 1.1003 1.0930 1.0915 1.1059 1.1024 1.0962 1.1011 1.0839 1.0984 1.0977 1.0869 1.0660 1.0669 1.0661
irintensity: 4.1897 0.3795 4.4474 2.3790 9.5498 12.3164 1.7315 0.3599 2.2013 8.2452 6.0989 224.5710 31.7741 23.9128 27.7757 2.4065 1.9012 0.0621 11.1889 8.2169 6.9859 6.5896 1.5964 1.0094 8.7179 0.2274 12.9125 10.4454 178.3050 46.4606 0.3840 36.1212 2.1232 20.2403 24.8489 12.5825 11.3785 6.1564 11.0340 5.7059 3.7047 6.7985 112.5794 46.7591 19.4111 16.7427 10.7012 28.5887 7.3159 28.6104 170.8835 36.7541 54.9620 12.8421 120.2821 13.6615 8.5006 3.0896 0.6673 90.9492 4.6695 4.7602 8.0710 16.9547 14.3987 30.1640 0.6908 4.9857 18.0808 0.6343 37.9661 10.5006 5.6447 7.7919 1.8065 6.8794 4.8193 3.9093 13.5854 9.6943 36.7172 8.2912 6.4480 24.5958 7.0932 94.6649 1.7828 7.4616 3.0059 3.4568 18.8614 8.8394 3.0736 29.7755 9.1188 11.4922 35.7483 157.0027 47.7457 51.6197 36.8384 86.2232 60.5834 127.9639 44.8935 66.4416 20.6662 96.9841 22.1310 69.4948 15.7601 71.3989 86.0307 16.6849 27.7061 61.7569 46.0994 349.4289 64.6170 37.9966
temp: 298.150 k
press: 1.00000 atm
elementType: 6 6 6 6 6 6 6 1 1 1 1 6 1 6 6 6 1 6 1 1 8 1 1 1 1 6 1 1 1 1 1 6 1 1 8 1 8 1 6 1 1 1
symmnumber: 1
zpe: 983034.9 jmol-1
zpe.correction: 0.374418 hartree
zpe.thermalcorrener: 0.391192 hartree
zpe.thermalcorrenthalpy: 0.392136 hartree
zpe.thermalcorrgfe: 0.333075 hartree
zpe.sumelectzpe: -811.416163 hartree
zpe.sumelectthermal: -811.399389 hartree
zpe.sumelectthermalent: -811.398445 hartree
zpe.sumelectthermalfe: -811.457507 hartree
dipole: -4.3204 3.3600 3.0285
dipole: 6.2551
quadrupole: -111.6951 -123.7099 -110.0309
quadrupole: 2.0394 5.9973 -2.3710
quadrupole: 3.4502 -8.5646 5.1144 2.0394 5.9973 -2.3710
hfenergy: -811.7905812 hartree
pointgroup: C01 [X(C15H24O3)]
dipole: -1.7298024 1.2842761 1.1894297 debye
polarizability: 246.5257583|4.445035|251.4483447|0.2327224|-0.9211895|215.5793521 unknown
InChI: InChI=1/15C.3O.24H
charge 0 multiplicity 1
42 atoms
C  -0.23791712 1.55267065 1.30834932
C  -0.0330247 0.02152811 1.54184836
C  -0.65940693 -0.85257585 0.40764415
C  -0.78132145 1.94755093 -0.10138327
C  -2.20127048 -0.71704696 0.1999617
C  -2.28786257 1.79779696 -0.03655206
C  -2.88839945 0.61791174 0.11595571
H  -0.92504198 1.95998185 2.05635027
H  0.7175055 2.06177456 1.47546562
H  -0.40732362 -0.25898679 2.53276716
H  -2.66327926 -1.24921342 1.04382958
C  -0.23200814 1.02053093 -1.24107767
H  -1.03433108 0.87171139 -1.96896548
C  0.24983315 -0.37180735 -0.76743985
C  1.71272009 -0.396335 -0.15845469
C  1.4745622 -0.30233407 1.38739009
H  1.74787437 -1.23449371 1.88801205
C  -0.46131145 -2.36367058 0.75925394
H  -1.18707882 -2.6243565 1.54469365
H  0.52372267 -2.56053441 1.17260203
O  -0.5948925 -3.25256812 -0.35204116
H  -1.38656554 -2.95643023 -0.8377308
H  2.0821616 0.47567694 1.86314842
H  0.20325743 -1.05841236 -1.61614645
H  0.56181213 1.5347933 -1.78783702
C  -0.43247573 3.41573374 -0.39696115
H  0.65171414 3.56224904 -0.43946128
H  -0.85441929 3.72894057 -1.35911653
H  -0.83282843 4.07803698 0.37978839
H  -3.97489991 0.56552073 0.18208849
H  -2.88964301 2.70530735 -0.07690275
C  2.58315122 0.78819467 -0.63712015
H  2.64567648 0.79277479 -1.72985684
H  2.15828854 1.74566395 -0.31747148
O  3.94597144 0.70637025 -0.19122679
H  3.96219254 0.75288307 0.77472179
O  -2.51240314 -1.48052814 -1.01527668
H  -3.47251135 -1.58542493 -1.07740648
C  2.4461402 -1.69053577 -0.57122266
H  2.69500278 -1.65798171 -1.63888118
H  3.38104868 -1.80052959 -0.01455656
H  1.83479278 -2.57848601 -0.40808577
