program: Gaussian 16
title: Title
version: ES64L-G16RevC.01
frameworkgroup: C1[X(C15H24O3)]
method: RB3LYP
basis: 6-31+G(d,p)
operation: Freq
keyword: #N
keyword: Geom=AllCheck
keyword: Guess=TCheck
keyword: SCRF=Check
keyword: GenChk
keyword: RB3LYP/6-31+G(d,p)
keyword: Freq
converged: YES YES NO YES
title: Mulliken charges:
elementType: C C C C C C C H H H H C H C C C H C H H O H H H H C H H H H H C H H O H O H C H H H
charge: -0.532217 -0.002942 -1.220400 0.337226 0.946836 -0.264168 -0.146499 0.149003 0.136375 0.132904 0.132911 -0.601544 0.153131 0.332260 -0.105966 -0.451438 0.147703 0.044434 0.121832 0.131327 -0.512060 0.395809 0.138295 0.138675 0.160701 -0.375046 0.154620 0.147842 0.157875 0.132697 0.136549 -0.089170 0.137339 0.138901 -0.579632 0.390677 -0.582355 0.405743 -0.402448 0.144419 0.158840 0.160962
chargesum: -0.00000
title: Mulliken charges with hydrogens summed into heavy atoms:
elementType: C C C C C C C C C C C C O C C O O C
charge: -0.246839 0.129962 -1.220400 0.337226 1.079747 -0.127619 -0.013802 -0.287712 0.470935 -0.105966 -0.165440 0.297592 -0.116251 0.085292 0.187070 -0.188955 -0.176612 0.061773
chargesum: 0.00000
1716.lowfreq: -11.1967 -8.3051 -0.0009 0.0010 0.0011 5.0685 71.2301 95.5649 126.0407
frequency: 71.2208 95.5125 126.0271 131.7958 172.7302 180.6050 213.4205 232.9056 237.4088 271.0448 275.5552 284.0858 290.5199 298.8987 319.7672 325.2954 347.2121 350.7123 387.5497 395.6250 411.4965 445.6772 458.5975 471.5254 511.3710 522.9852 554.4481 585.4765 600.7684 622.3658 652.7915 689.4091 706.6983 725.9377 767.3654 813.5274 852.2883 870.3947 893.8394 904.5239 910.4419 916.1487 937.1983 945.9244 954.7822 975.5181 987.9971 997.8663 1002.7911 1015.5491 1033.3741 1044.6235 1052.6591 1060.9071 1076.1663 1102.8327 1120.0309 1130.3603 1144.1881 1151.1298 1170.2749 1185.4947 1189.2755 1214.4703 1225.3142 1233.4891 1257.6708 1269.4979 1280.4211 1283.8628 1296.6425 1311.4749 1327.1830 1329.9969 1338.4853 1346.8792 1352.8767 1368.0963 1377.7314 1382.7478 1412.7229 1414.1927 1425.9144 1435.3151 1447.9292 1459.3091 1491.6660 1495.4161 1496.8478 1500.8846 1502.0456 1510.5172 1527.9368 1537.7349 1539.3097 1737.0093 2983.9595 2999.1011 3005.9683 3023.6141 3035.8077 3040.3431 3048.4616 3059.8025 3062.2216 3066.5550 3081.4995 3091.2557 3093.6689 3098.2530 3101.9367 3107.0330 3123.1039 3132.9302 3155.1264 3156.9795 3171.6264 3652.7241 3809.1974 3826.4901
redmass: 5.0487 3.9598 4.4534 4.6371 3.5836 2.2488 1.2428 1.7016 1.6654 2.9657 1.7606 2.1284 1.5958 1.8188 2.5746 2.7661 2.6708 3.3885 2.6740 2.4425 2.9985 2.7593 2.7790 2.9194 3.2067 2.8423 2.1626 3.2081 2.0578 1.6050 3.8975 3.4934 3.2756 2.6461 2.2170 3.0876 2.5615 2.2721 2.6079 2.1095 2.1564 2.2266 2.1940 3.4286 2.2141 1.8695 1.6391 2.4092 1.4413 1.9138 2.5432 3.1552 2.8345 2.4685 2.8608 2.2262 2.2181 2.1488 1.7762 1.7545 1.5488 2.4562 1.7964 1.2643 1.2866 1.3472 1.2008 1.4404 1.3999 1.5447 1.2246 1.4116 1.4297 1.3980 1.5173 1.4038 1.2760 1.4148 1.2733 1.4545 1.2290 1.2859 1.5750 1.3835 1.3354 1.1997 1.0545 1.0620 1.0491 1.0660 1.0692 1.0782 1.0681 1.0754 1.0855 7.1449 1.0791 1.0803 1.0643 1.0356 1.0447 1.0644 1.0766 1.0898 1.0803 1.0704 1.1016 1.1023 1.1008 1.0862 1.1020 1.0961 1.0959 1.0838 1.0970 1.0976 1.0869 1.0659 1.0668 1.0669
irintensity: 4.6384 1.3146 3.4846 1.7800 8.4480 32.3459 144.4096 33.2375 1.1047 6.6763 9.5836 18.7692 69.3369 34.7827 5.1820 9.5086 3.9280 0.6759 2.6515 2.1152 4.5919 1.9548 0.7192 7.4491 5.9061 1.1672 18.7915 35.9544 54.9748 147.4641 0.6730 27.3578 8.8846 14.1767 32.5011 14.4655 11.9958 9.0406 8.7098 4.1612 16.8107 2.6254 19.7075 122.6673 16.3661 9.8822 11.4202 53.3166 4.7137 27.0658 25.7738 85.6643 85.0873 14.5326 119.0117 20.3420 16.1859 7.5310 11.1205 40.5842 11.3772 1.7069 12.6118 8.4741 56.0191 46.2355 4.6253 13.2100 3.2384 6.3492 19.7132 17.8466 13.4944 2.3854 7.0759 0.7978 8.3981 1.7356 4.9727 3.9763 5.1811 10.3035 22.0759 5.5062 6.0962 96.7316 7.6925 6.7141 4.7724 7.9435 0.6624 9.5476 26.0552 16.5379 16.5983 11.9529 19.4549 171.9657 74.7537 51.0019 69.4155 49.7857 23.2414 120.6145 161.8834 25.5108 49.3536 56.6258 61.5074 28.1366 62.0934 56.1925 28.5505 18.6118 27.3239 64.0356 48.2107 341.6170 64.6848 65.3803
temp: 298.150 k
press: 1.00000 atm
elementType: 6 6 6 6 6 6 6 1 1 1 1 6 1 6 6 6 1 6 1 1 8 1 1 1 1 6 1 1 1 1 1 6 1 1 8 1 8 1 6 1 1 1
symmnumber: 1
zpe: 982338.5 jmol-1
zpe.correction: 0.374153 hartree
zpe.thermalcorrener: 0.391010 hartree
zpe.thermalcorrenthalpy: 0.391955 hartree
zpe.thermalcorrgfe: 0.332681 hartree
zpe.sumelectzpe: -811.417414 hartree
zpe.sumelectthermal: -811.400556 hartree
zpe.sumelectthermalent: -811.399612 hartree
zpe.sumelectthermalfe: -811.458885 hartree
dipole: -1.8584 4.4847 2.9998
dipole: 5.7066
quadrupole: -94.8163 -120.9504 -114.6984
quadrupole: 9.3731 4.4892 -4.0939
quadrupole: 15.3387 -10.7953 -4.5434 9.3731 4.4892 -4.0939
hfenergy: -811.7915667 hartree
pointgroup: C01 [X(C15H24O3)]
dipole: -0.8018053 1.7316422 1.1828821 debye
polarizability: 244.4093148|4.7152796|252.7914067|2.4362441|0.7375261|217.8375658 unknown
InChI: InChI=1/15C.3O.24H
charge 0 multiplicity 1
42 atoms
C  -0.41016751 1.47141718 1.45946723
C  -0.20677753 -0.06622935 1.63634106
C  -0.65512902 -0.88513035 0.38270679
C  -0.73991204 1.93712231 0.00621765
C  -2.15504118 -0.74977262 -0.02900531
C  -2.23576957 1.77328595 -0.17039202
C  -2.83616007 0.58354798 -0.16651932
H  -1.21296543 1.82488128 2.11405269
H  0.49696525 1.98317157 1.79892342
H  -0.70796535 -0.40580271 2.54994257
H  -2.72270454 -1.30940976 0.72866729
C  -0.00662298 1.08094946 -1.08262543
H  -0.67860532 0.98630152 -1.9407163
C  0.40450796 -0.33999365 -0.62848164
C  1.76659457 -0.39501408 0.17789716
C  1.31368953 -0.36358213 1.67710395
H  1.5327378 -1.31411953 2.17048083
C  -0.48921613 -2.41060436 0.68659731
H  -1.32315042 -2.71772352 1.33618983
H  0.42300054 -2.61896072 1.23841227
O  -0.43514561 -3.24399379 -0.47358048
H  -1.15772643 -2.93906083 -1.05229547
H  1.84664574 0.40002513 2.25370704
H  0.47820298 -0.97832289 -1.51168171
H  0.8703341 1.61399772 -1.45272798
C  -0.37268275 3.42166941 -0.15584167
H  -0.89752822 4.03987488 0.58241286
H  0.70310853 3.57682675 -0.02303382
H  -0.64556843 3.78246408 -1.15455824
H  -3.91882316 0.52115058 -0.27453291
H  -2.83745886 2.67677259 -0.26692091
C  2.70330299 0.80270481 -0.05282886
H  2.21458532 1.74261438 0.22977243
H  3.57981001 0.68066765 0.5997703
O  3.12238352 0.85588088 -1.42596833
H  3.71505699 1.61092031 -1.53645393
O  -2.2940927 -1.477204 -1.29697998
H  -3.23618003 -1.59236478 -1.48603579
C  2.5675082 -1.6678513 -0.17179289
H  3.4225384 -1.77561503 0.50684383
H  1.96004399 -2.57073349 -0.10637463
H  2.95298185 -1.60228354 -1.19322288
