program: Gaussian 16
title: Title
version: ES64L-G16RevC.01
frameworkgroup: C1[X(C15H24O3)]
method: RB3LYP
basis: 6-31+G(d,p)
operation: Freq
keyword: #N
keyword: Geom=AllCheck
keyword: Guess=TCheck
keyword: SCRF=Check
keyword: GenChk
keyword: RB3LYP/6-31+G(d,p)
keyword: Freq
converged: YES YES NO YES
title: Mulliken charges:
elementType: C C C C C C C H H H H C H C C C H C H H O H H H H C H H H H H C H H O H O H C H H H
charge: -0.834204 0.022015 -1.117871 0.719276 0.632548 -0.140645 -0.079419 0.140914 0.155137 0.129627 0.136521 -0.856631 0.140969 0.286604 0.259325 -0.548034 0.141391 0.088630 0.123913 0.134229 -0.493881 0.395873 0.146697 0.144329 0.147752 -0.424756 0.150205 0.148375 0.168385 0.136679 0.136174 -0.199672 0.134650 0.138810 -0.632139 0.405698 -0.483025 0.372528 -0.396498 0.152475 0.170082 0.146964
chargesum: -0.00000
title: Mulliken charges with hydrogens summed into heavy atoms:
elementType: C C C C C C C C C C C C O C C O O C
charge: -0.538154 0.151642 -1.117871 0.719276 0.769069 -0.004471 0.057260 -0.567910 0.430933 0.259325 -0.259946 0.346772 -0.098008 0.042209 0.073788 -0.226440 -0.110497 0.073023
1716.lowfreq: -10.1830 -0.0004 0.0005 0.0008 2.4145 8.4803 90.7571 124.9613 129.8728
frequency: 90.7454 124.9601 129.8726 154.5970 175.8855 193.0816 213.5966 234.0177 243.8760 257.5676 271.5018 282.0069 302.0403 307.7269 322.4576 339.2755 358.4150 385.3577 388.8388 410.8710 417.0839 429.1776 459.0908 489.8562 513.1068 525.1140 554.4581 569.3496 601.3095 631.3233 646.5188 685.8618 700.0311 732.0587 772.0719 806.6309 841.6103 863.9509 883.2844 895.4371 902.5216 912.6995 932.8368 940.5713 952.3395 985.2699 986.3319 1003.6161 1009.6474 1026.2265 1034.0220 1052.1500 1056.5088 1066.5254 1075.6668 1104.0236 1111.9973 1122.0065 1145.9140 1157.1779 1176.5949 1188.1948 1197.6116 1211.6869 1224.7616 1245.9801 1252.0352 1255.6323 1279.4658 1284.8470 1297.0210 1320.7912 1328.6952 1331.1801 1334.3111 1346.1696 1365.9826 1369.0699 1377.2265 1390.8055 1404.4634 1410.6477 1418.6199 1431.5680 1453.5892 1459.5332 1490.7209 1494.6737 1495.8695 1505.3133 1506.8890 1510.2283 1518.5180 1526.2739 1541.0358 1735.0272 2987.8027 2994.0278 3022.4671 3028.3548 3032.3651 3041.6309 3043.5222 3044.2046 3056.9091 3067.7191 3072.4713 3082.1201 3086.0192 3104.7818 3115.3222 3121.0336 3135.6580 3138.4124 3163.4400 3166.1059 3173.0455 3646.3527 3796.2416 3828.1679
redmass: 5.7633 3.6721 4.6902 4.5638 3.3432 1.7085 1.6180 2.2879 1.5007 2.5747 3.1708 1.5354 1.9491 3.0690 3.8419 2.1699 2.1529 1.6473 1.8925 2.7518 2.5776 2.6121 2.9581 3.3747 3.5012 2.9723 2.3125 3.0007 3.4944 1.2485 4.0329 2.5051 4.2077 2.5391 2.1824 2.9003 2.6401 2.3524 2.3361 2.0958 2.4187 2.4067 2.1198 3.8552 1.8037 1.6348 2.4901 1.4989 1.7742 2.4185 1.8658 2.6135 3.8891 2.7191 2.6169 2.6079 2.2051 2.2226 1.8423 1.5329 2.0848 2.5185 2.0943 1.1978 1.3565 1.2915 1.2028 1.2975 1.4762 1.4108 1.5726 1.3013 1.4585 1.3151 1.5235 1.3474 1.2109 1.3892 1.3840 1.2258 1.2668 1.4173 1.2148 1.5100 1.2895 1.2048 1.0665 1.0767 1.0641 1.0576 1.0481 1.0779 1.0725 1.0784 1.0750 7.2862 1.0763 1.0561 1.0386 1.0465 1.1040 1.0781 1.0809 1.0772 1.0696 1.0753 1.0780 1.1018 1.0997 1.1014 1.0994 1.0914 1.0979 1.0855 1.0940 1.0965 1.0878 1.0661 1.0663 1.0669
irintensity: 4.2156 7.5874 6.7875 4.5813 14.5353 103.2406 64.9758 9.6729 2.6458 15.8909 2.2820 1.5735 3.5201 4.0230 0.1486 5.8976 21.3344 45.1552 105.2414 3.4279 1.6330 2.5577 9.6839 2.9046 16.7691 4.9208 13.7713 25.2030 3.1296 143.3827 4.7352 70.4271 1.1771 9.2125 36.9386 11.6824 1.0354 25.0073 24.0225 32.9087 21.5447 7.2001 2.7749 142.1348 6.9075 7.5947 5.4058 5.7118 10.8693 41.2940 45.0639 61.8306 72.5963 24.6019 152.0269 10.7309 5.1535 1.7757 16.7850 5.7205 12.1675 17.3330 1.7121 21.6858 19.7560 3.1768 37.4518 28.4323 1.8253 3.1655 6.7525 4.9801 1.4848 4.0164 0.7344 2.1053 26.6500 4.7710 10.4041 40.6784 7.4809 29.4191 6.9836 9.3691 3.7209 102.8499 5.9636 6.9684 2.0540 3.9118 11.7935 16.2664 7.1024 22.2821 13.0406 12.2508 105.3673 85.0741 70.7014 74.3006 96.9302 10.6309 30.1707 108.1935 106.8908 140.4238 20.0260 61.9288 87.0570 12.1244 48.5999 37.5758 34.8653 21.2080 32.0972 56.4966 34.7105 352.6763 42.9440 61.2462
temp: 298.150 k
press: 1.00000 atm
elementType: 6 6 6 6 6 6 6 1 1 1 1 6 1 6 6 6 1 6 1 1 8 1 1 1 1 6 1 1 1 1 1 6 1 1 8 1 8 1 6 1 1 1
symmnumber: 1
zpe: 983397.8 jmol-1
zpe.correction: 0.374556 hartree
zpe.thermalcorrener: 0.391161 hartree
zpe.thermalcorrenthalpy: 0.392105 hartree
zpe.thermalcorrgfe: 0.333756 hartree
zpe.sumelectzpe: -811.415594 hartree
zpe.sumelectthermal: -811.398990 hartree
zpe.sumelectthermalent: -811.398046 hartree
zpe.sumelectthermalfe: -811.456395 hartree
dipole: 4.4597 1.3244 -0.6884
dipole: 4.7028
quadrupole: -116.8378 -115.1111 -107.8637
quadrupole: -11.0178 -6.5473 -1.1048
quadrupole: -3.5670 -1.8402 5.4072 -11.0178 -6.5473 -1.1048
hfenergy: -811.7901503 hartree
pointgroup: C01 [X(C15H24O3)]
dipole: 1.7631058 0.4897026 -0.2738471 debye
polarizability: 254.1701468|5.7690587|245.0744445|-0.8086027|0.5326305|217.3434974 unknown
InChI: InChI=1/15C.3O.24H
charge 0 multiplicity 1
42 atoms
C  0.99466735 1.11881991 1.347266
C  -0.00847156 -0.05795868 1.54751734
C  -1.0701056 -0.15179679 0.40394488
C  0.97688121 1.7688155 -0.07256498
C  -1.98044754 1.10108026 0.17257392
C  -0.13230672 2.80105119 -0.07140168
C  -1.42226422 2.48913763 0.05653796
H  0.7972854 1.90895725 2.07905699
H  2.0037604 0.75008212 1.54417095
H  -0.4800223 0.02172717 2.53401106
H  -2.69120433 1.11806036 1.0068941
C  0.69671709 0.72306087 -1.20491396
H  0.14166515 1.23271484 -2.00039721
C  -0.09815541 -0.53167638 -0.76089589
C  0.79648017 -1.6839829 -0.14751638
C  0.74508113 -1.40877767 1.39222263
H  0.22902176 -2.21903397 1.91509623
C  -2.09109738 -1.27744319 0.76883719
H  -2.75337687 -0.88434472 1.55541934
H  -1.60291573 -2.1516701 1.19013486
O  -2.86677574 -1.75935158 -0.33176075
H  -3.15999129 -0.96771011 -0.81925013
H  1.74620726 -1.34851003 1.82424747
H  -0.63855067 -0.92570357 -1.62727783
H  1.64301408 0.41937589 -1.65424768
C  2.3156573 2.4789695 -0.33438976
H  2.30176412 2.98656777 -1.30690156
H  2.51311003 3.2350721 0.43560637
H  3.13302687 1.75452029 -0.33124182
H  -2.17926921 3.271287 0.06457287
H  0.15491197 3.84978514 -0.14518672
C  2.24773096 -1.74839265 -0.66755323
H  2.66090018 -2.72956907 -0.39568281
H  2.24198742 -1.6849774 -1.76577181
O  3.08120661 -0.72126117 -0.11462287
H  3.97290284 -0.83188492 -0.4695098
O  -2.85536347 0.87141507 -0.98544295
H  -2.34525081 1.06871513 -1.78504522
C  0.2163581 -3.06821309 -0.53471114
H  0.64747801 -3.85633508 0.09300536
H  -0.86839067 -3.10934082 -0.44748562
H  0.45847209 -3.3015371 -1.57935469
