program: Gaussian 16
title: Title
version: ES64L-G16RevC.01
frameworkgroup: C1[X(C15H24O3)]
method: RB3LYP
basis: 6-31+G(d,p)
operation: Freq
keyword: #N
keyword: Geom=AllCheck
keyword: Guess=TCheck
keyword: SCRF=Check
keyword: GenChk
keyword: RB3LYP/6-31+G(d,p)
keyword: Freq
converged: YES YES NO YES
title: Mulliken charges:
elementType: C C C C C C C H H H H C H C C C H C H H O H H H H C H H H H H C H H O H O H C H H H
charge: -0.927747 0.235776 -1.262416 0.719915 0.893020 -0.170686 -0.136120 0.143927 0.131954 0.131136 0.132237 -0.854046 0.150479 0.353390 0.310119 -0.548442 0.146778 0.007977 0.121517 0.133898 -0.514191 0.396167 0.114023 0.138126 0.140936 -0.417132 0.173782 0.150235 0.147516 0.131460 0.134994 -0.278031 0.138713 0.146977 -0.567204 0.367031 -0.578960 0.404418 -0.412025 0.171067 0.147735 0.151700
chargesum: -0.00000
title: Mulliken charges with hydrogens summed into heavy atoms:
elementType: C C C C C C C C C C C C O C C O O C
charge: -0.651866 0.366911 -1.262416 0.719915 1.025257 -0.035692 -0.004661 -0.562630 0.491515 0.310119 -0.287641 0.263392 -0.118024 0.054400 0.007659 -0.200173 -0.174542 0.058477
1716.lowfreq: -10.0809 -5.7718 0.0004 0.0007 0.0009 11.5630 72.5913 118.7989 127.8330
frequency: 72.5656 118.7978 127.8324 148.4596 172.4340 202.4206 232.0657 234.6654 244.7942 269.2783 279.4405 286.7711 291.5901 305.0703 310.4476 326.8484 342.1071 363.3034 384.2876 410.6338 416.0956 428.6984 460.2228 488.7893 514.4640 524.1877 551.9521 578.6281 599.7650 615.5271 645.5632 680.2112 700.6284 731.7583 770.3474 809.2567 837.9059 863.2714 881.8729 895.2503 901.2677 914.4562 932.4365 942.3039 951.9250 977.7225 986.5465 995.2968 1002.6397 1019.0169 1031.0298 1047.8256 1055.5453 1059.6282 1075.6694 1099.1401 1119.5666 1123.3381 1133.8280 1149.4139 1173.0792 1174.9974 1187.0573 1217.6839 1230.3650 1243.5163 1254.1399 1261.2953 1276.6431 1285.0197 1307.1992 1321.7874 1325.1695 1336.3126 1344.9762 1352.4448 1362.9913 1377.7682 1382.1923 1391.6977 1405.7314 1409.7726 1426.1772 1432.8142 1435.0715 1460.9390 1490.7910 1492.4252 1494.7744 1500.6652 1506.9962 1509.7114 1511.2302 1528.1947 1539.6782 1738.7867 2984.5421 3000.1011 3019.3942 3021.6680 3028.4173 3043.7692 3055.4206 3060.7126 3066.9597 3080.6634 3081.2717 3084.1856 3086.1843 3090.5698 3101.0783 3121.2576 3130.5341 3135.6898 3154.9461 3162.8318 3171.4068 3646.0242 3807.6998 3837.9020
redmass: 5.0368 3.9549 4.8454 4.0288 4.0949 2.7000 2.5728 1.8722 1.4527 2.5147 1.6440 1.3898 1.3851 2.1563 2.3520 3.0303 1.9253 2.9022 2.8172 2.7018 2.5613 2.6575 2.8018 3.2645 3.5853 2.9911 2.2432 3.0535 2.0470 1.6222 3.9165 2.9059 4.2868 2.4633 2.3209 2.9499 2.5194 2.0711 2.2494 2.5743 2.2927 2.2668 2.1741 3.6706 1.9590 1.7406 1.7536 2.4220 1.4120 1.8180 2.4244 3.3490 3.7013 2.2591 2.8943 2.2227 2.4745 2.2969 1.8706 1.8004 1.6724 1.4912 2.3091 1.3438 1.2801 1.3877 1.4231 1.3934 1.5743 1.4030 1.5062 1.4772 1.3285 1.5386 1.3360 1.2643 1.3546 1.2663 1.4464 1.1546 1.2625 1.2279 1.5607 1.2673 1.3467 1.1996 1.0662 1.0730 1.0619 1.0738 1.0634 1.0504 1.0667 1.0754 1.0793 7.1929 1.0796 1.0797 1.0601 1.0386 1.0465 1.0779 1.0659 1.0699 1.0694 1.1007 1.1018 1.0916 1.0940 1.1033 1.1003 1.0951 1.0838 1.0986 1.0976 1.0935 1.0882 1.0659 1.0669 1.0668
irintensity: 4.4458 6.5900 8.4529 3.5172 9.5051 7.1501 71.9592 27.4685 7.9360 14.8871 56.7498 95.4434 81.8864 18.4887 37.8364 5.8551 4.2040 0.3322 3.0002 5.6231 0.8851 0.1684 5.1328 3.9882 7.8511 2.4484 26.3236 13.4279 56.8451 136.4511 16.3816 30.8446 1.7076 20.0348 26.9881 7.5249 23.0442 7.8354 14.9106 24.5983 2.9872 5.1397 10.4601 155.9309 9.6614 19.4555 7.1488 5.7046 4.5548 33.2209 12.2472 179.0230 16.0048 18.3155 144.1406 3.5298 4.1080 7.7207 7.1329 98.2338 1.8343 1.4123 10.6783 5.4847 19.4869 9.4305 4.1772 4.5085 29.2615 15.2853 29.3003 5.9563 3.0509 8.7545 0.1449 6.5882 0.5692 4.0453 6.7888 21.0684 10.2680 5.6001 17.9377 7.1723 19.9125 95.3368 8.5937 1.2157 3.1564 3.8703 14.9028 6.5755 2.2753 35.0238 10.8371 11.9430 14.5693 180.7642 38.0631 68.3142 128.4734 32.1855 60.4147 64.3913 153.9075 1.2327 64.9261 14.7523 131.9715 47.5293 85.0754 38.0017 23.5470 25.6720 69.5997 27.1091 35.5024 358.8010 62.5242 52.5639
temp: 298.150 k
press: 1.00000 atm
elementType: 6 6 6 6 6 6 6 1 1 1 1 6 1 6 6 6 1 6 1 1 8 1 1 1 1 6 1 1 1 1 1 6 1 1 8 1 8 1 6 1 1 1
symmnumber: 1
zpe: 982733.0 jmol-1
zpe.correction: 0.374303 hartree
zpe.thermalcorrener: 0.391005 hartree
zpe.thermalcorrenthalpy: 0.391950 hartree
zpe.thermalcorrgfe: 0.333265 hartree
zpe.sumelectzpe: -811.414324 hartree
zpe.sumelectthermal: -811.397622 hartree
zpe.sumelectthermalent: -811.396678 hartree
zpe.sumelectthermalfe: -811.455362 hartree
dipole: 0.4122 2.0340 2.8182
dipole: 3.4999
quadrupole: -111.4382 -113.2706 -111.2988
quadrupole: -16.8755 2.8282 -2.6770
quadrupole: 0.5643 -1.2681 0.7038 -16.8755 2.8282 -2.6770
hfenergy: -811.7886271 hartree
pointgroup: C01 [X(C15H24O3)]
dipole: 0.1861205 0.7952174 1.1086143 debye
polarizability: 254.9317429|4.97146|245.4794161|0.0386349|0.560496|216.587508 unknown
InChI: InChI=1/15C.3O.24H
charge 0 multiplicity 1
42 atoms
C  0.98036668 1.13255429 1.34536757
C  -0.01161397 -0.05324413 1.54668062
C  -1.07172361 -0.15779038 0.40276521
C  0.96274804 1.77803523 -0.07598485
C  -1.98523776 1.08840153 0.17664225
C  -0.15087209 2.80574482 -0.07515184
C  -1.4367211 2.48128556 0.05307151
H  0.77310528 1.92236054 2.0745854
H  1.9933738 0.77937919 1.55478222
H  -0.48228871 0.02158457 2.53383985
H  -2.68474344 1.10435639 1.02512341
C  0.68163203 0.73180722 -1.2083096
H  0.1032506 1.23341899 -1.99031552
C  -0.09717763 -0.53106552 -0.76146304
C  0.80828942 -1.67327696 -0.14823392
C  0.75210191 -1.39776258 1.39010521
H  0.24431197 -2.2127994 1.91322653
C  -2.08490838 -1.29227315 0.7684944
H  -2.763969 -0.89700498 1.53926123
H  -1.59036988 -2.15340921 1.20945969
O  -2.83726445 -1.80108816 -0.33563461
H  -3.13143204 -1.01878073 -0.83763298
H  1.74458306 -1.33150682 1.84535234
H  -0.63783714 -0.9264473 -1.62574789
H  1.6259056 0.44216559 -1.67129653
C  2.29947793 2.49175811 -0.33811237
H  3.11807072 1.76875972 -0.34208949
H  2.28091016 3.00293146 -1.30866271
H  2.49718841 3.24602837 0.43377285
H  -2.19695906 3.2622125 0.06973365
H  0.13006268 3.85627238 -0.14831881
C  2.26345152 -1.72413073 -0.68080047
H  2.68793175 -2.70301342 -0.42176859
H  2.24932375 -1.65921529 -1.77398929
O  3.15596367 -0.69420584 -0.23850643
H  3.4842242 -0.92249196 0.63998005
O  -2.77522288 0.79393232 -1.02728406
H  -3.48791998 1.44503364 -1.09579488
C  0.24459361 -3.06538799 -0.52886494
H  -0.83789073 -3.12479771 -0.42609249
H  0.47513411 -3.29294802 -1.57747232
H  0.69811694 -3.84809412 0.0902066
