program: Gaussian 16
title: Title
version: ES64L-G16RevC.01
frameworkgroup: C1[X(C15H24O3)]
method: RB3LYP
basis: 6-31+G(d,p)
operation: Freq
keyword: #N
keyword: Geom=AllCheck
keyword: Guess=TCheck
keyword: SCRF=Check
keyword: GenChk
keyword: RB3LYP/6-31+G(d,p)
keyword: Freq
converged: YES YES NO YES
title: Mulliken charges:
elementType: C C C C C C C H H H H C H C C C H C H H O H H H H C H H H H H C H H O H O H C H H H
charge: -0.563894 0.126777 -1.205557 0.347164 0.403041 -0.182390 -0.035271 0.148728 0.138676 0.132590 0.105731 -0.522498 0.164070 0.132100 -0.023375 -0.335645 0.141362 0.372891 0.144610 0.138636 -0.577747 0.408214 0.149384 0.142796 0.136210 -0.381086 0.155119 0.148176 0.159034 0.130253 0.133446 -0.212805 0.142363 0.144706 -0.519164 0.368577 -0.563974 0.405466 -0.471129 0.164696 0.154813 0.154905
chargesum: -0.00000
title: Mulliken charges with hydrogens summed into heavy atoms:
elementType: C C C C C C C C C C C C O C C O O C
charge: -0.276489 0.259367 -1.205557 0.347164 0.508772 -0.048944 0.094983 -0.222218 0.274896 -0.023375 -0.044899 0.656137 -0.169533 0.081242 0.074264 -0.150587 -0.158508 0.003285
chargesum: 0.00000
1716.lowfreq: -6.0932 -0.0011 -0.0009 0.0002 6.0004 10.0400 77.0511 81.2299 120.7512
frequency: 77.0462 81.1998 120.7470 129.6334 157.5495 203.7099 226.2787 232.6921 257.6762 277.7325 283.7458 289.2984 294.9083 299.8480 326.0798 332.4014 336.0306 360.7475 382.3988 400.0228 410.6971 434.3585 451.4484 472.1877 516.4100 520.5846 555.9041 583.9101 610.9983 630.8497 661.5525 675.1041 703.0628 737.6373 768.7424 813.3847 847.7783 872.8088 885.3431 898.3348 918.8010 930.3635 937.9160 947.0826 971.1216 978.0383 986.1926 994.1000 1000.4382 1017.1464 1028.8647 1037.7624 1043.2173 1056.2842 1078.2550 1102.1135 1113.9357 1121.1398 1137.1416 1154.4411 1171.9535 1184.8068 1191.6630 1203.8968 1238.5106 1244.9718 1258.7117 1267.1868 1278.1856 1280.8378 1296.0264 1303.9988 1322.8480 1332.2501 1333.6724 1346.2304 1364.7663 1374.2806 1379.9534 1386.4275 1411.6295 1416.8582 1427.4586 1427.7250 1442.0384 1461.7922 1493.8285 1495.9650 1497.8185 1501.3126 1506.6821 1512.4484 1523.1907 1535.4583 1545.8714 1739.9421 2960.8554 3012.0739 3024.4671 3026.6926 3033.2433 3040.9908 3053.8036 3070.8913 3072.3059 3081.5364 3086.7238 3091.7173 3092.5756 3101.0221 3102.3705 3108.1890 3134.2483 3137.2899 3140.9576 3154.6190 3164.9286 3635.1959 3822.8343 3826.8955
redmass: 5.5318 4.8957 3.8284 3.6655 3.5846 2.5488 2.1950 1.3879 2.7347 1.7112 1.2434 2.1312 3.0730 2.1024 1.8298 3.5030 1.6934 2.8782 2.5980 2.6388 2.4916 2.7559 2.9373 2.9581 3.5501 2.8841 2.1156 2.9792 1.2487 3.3144 3.9369 2.7553 4.2024 2.3254 2.3371 3.1533 2.5003 2.4131 2.4542 2.3369 2.3320 1.8375 2.0106 2.0115 1.7588 2.2396 3.1633 2.3517 1.4970 2.0237 3.2749 3.1123 2.6627 2.1721 2.4500 2.3572 1.6687 2.0444 2.0276 1.4709 2.2610 2.4037 2.1520 1.2108 1.2320 1.5918 1.3423 1.5397 1.4972 1.3748 1.1951 1.2145 1.5017 1.3671 1.5032 1.3807 1.3452 1.3685 1.2600 1.3444 1.2983 1.2078 1.2543 1.2931 1.3108 1.5853 1.0744 1.0538 1.0569 1.0599 1.0696 1.0649 1.0681 1.0742 1.0846 7.3381 1.0829 1.0701 1.0356 1.0429 1.0727 1.0632 1.0820 1.0668 1.0650 1.1006 1.0997 1.0964 1.0916 1.1041 1.1022 1.1026 1.0934 1.0849 1.0955 1.0897 1.0966 1.0661 1.0665 1.0670
irintensity: 2.7741 5.1440 3.4570 1.1434 3.0625 12.9638 4.9597 19.8028 27.6953 4.4958 137.9872 20.7254 38.4572 23.1687 11.1026 5.7799 53.3056 8.2114 13.1839 3.0249 0.4941 4.2573 9.7642 8.8359 10.0627 13.0415 2.3998 27.9689 172.4645 27.9115 0.3446 51.9133 1.4262 15.7789 12.5820 4.1727 4.9848 9.5334 10.4580 5.1818 1.9505 25.6881 4.0708 41.9443 7.9566 42.8032 7.2579 86.7399 22.3254 32.4938 91.3051 52.8972 48.1819 8.4186 119.6309 7.1493 29.9932 3.2385 1.8659 11.7834 7.1660 1.0376 8.2112 4.3030 27.1100 35.0726 21.5176 13.0032 3.0035 2.0555 66.2941 63.9859 0.2614 6.8993 0.5172 2.0623 1.0264 5.3488 6.2647 11.5521 16.4168 9.3952 18.9379 5.5119 2.2064 66.5693 2.1101 7.3744 7.2267 14.2928 3.5353 14.6268 0.1308 20.5832 17.0862 10.6764 90.8304 77.9180 53.2061 84.2494 64.2446 66.4899 36.0769 124.5120 32.1398 75.7746 43.1317 1.1634 116.6767 49.0420 51.2056 62.8698 43.2437 22.6426 33.6578 45.0506 61.5478 376.2330 52.3752 83.1682
temp: 298.150 k
press: 1.00000 atm
elementType: 6 6 6 6 6 6 6 1 1 1 1 6 1 6 6 6 1 6 1 1 8 1 1 1 1 6 1 1 1 1 1 6 1 1 8 1 8 1 6 1 1 1
symmnumber: 1
zpe: 983048.2 jmol-1
zpe.correction: 0.374423 hartree
zpe.thermalcorrener: 0.391209 hartree
zpe.thermalcorrenthalpy: 0.392153 hartree
zpe.thermalcorrgfe: 0.332952 hartree
zpe.sumelectzpe: -811.415595 hartree
zpe.sumelectthermal: -811.398809 hartree
zpe.sumelectthermalent: -811.397865 hartree
zpe.sumelectthermalfe: -811.457067 hartree
dipole: 1.3872 -3.0292 2.3242
dipole: 4.0623
quadrupole: -124.9085 -98.0297 -113.9785
quadrupole: -7.5288 -11.8472 -6.2979
quadrupole: -12.6030 14.2759 -1.6729 -7.5288 -11.8472 -6.2979
hfenergy: -811.7900186 hartree
pointgroup: C01 [X(C15H24O3)]
dipole: 0.5792385 -1.1734484 0.9175103 debye
polarizability: 244.911545|3.3218685|252.0825186|-0.1618262|-1.6227031|215.3303342 unknown
InChI: InChI=1/15C.3O.24H
charge 0 multiplicity 1
42 atoms
C  -0.25821863 1.55613416 1.30955916
C  -0.0342183 0.02875372 1.54107252
C  -0.64968811 -0.85610345 0.40363656
C  -0.82266261 1.93563344 -0.09354969
C  -2.19775168 -0.76328398 0.14510398
C  -2.32568166 1.75489582 -0.00681287
C  -2.9062943 0.56298793 0.12463957
H  -0.94126545 1.95785865 2.06445015
H  0.69381673 2.07545398 1.46454547
H  -0.40623333 -0.25765745 2.53110742
H  -2.66639261 -1.33871197 0.96007346
C  -0.25611663 1.02089233 -1.23478323
H  -1.05712108 0.85512719 -1.95980404
C  0.25675714 -0.36446252 -0.76844545
C  1.7167572 -0.36482845 -0.15652563
C  1.47967197 -0.27119534 1.38746126
H  1.76707422 -1.19794767 1.89118836
C  -0.422761 -2.34390784 0.78563912
H  -1.11072692 -2.60009219 1.60136813
H  0.58686327 -2.53858216 1.14043287
O  -0.68155616 -3.19176429 -0.35669777
H  -0.7239914 -4.11129194 -0.06169379
H  2.09160554 0.513702 1.84028031
H  0.21865257 -1.04579259 -1.62202011
H  0.52647114 1.55242914 -1.7815259
C  -0.50926551 3.41058456 -0.39610282
H  -0.91736008 4.06601199 0.3825296
H  0.57098381 3.58195338 -0.44870937
H  -0.94677358 3.71191214 -1.35516973
H  -3.98990879 0.4890772 0.19688124
H  -2.94079811 2.65460023 -0.00566715
C  2.56796283 0.83396547 -0.63202668
H  2.63553067 0.83886991 -1.72922462
H  2.12597626 1.78001856 -0.31746877
O  3.88623147 0.84966408 -0.0623251
H  4.39564934 0.11407751 -0.42723001
O  -2.54768457 -1.40259508 -1.10750271
H  -2.0929266 -2.26559131 -1.10949744
C  2.46727261 -1.65005256 -0.5729162
H  1.85089308 -2.54309768 -0.45997493
H  2.76084108 -1.59720375 -1.62891894
H  3.37108417 -1.79727621 0.02908878
