program: Gaussian 16
title: Title
version: ES64L-G16RevC.01
frameworkgroup: C1[X(C15H24O3)]
method: RB3LYP
basis: 6-31+G(d,p)
operation: Freq
keyword: #N
keyword: Geom=AllCheck
keyword: Guess=TCheck
keyword: SCRF=Check
keyword: GenChk
keyword: RB3LYP/6-31+G(d,p)
keyword: Freq
converged: YES YES NO YES
title: Mulliken charges:
elementType: C C C C C C C H H H H C H C C C H C H H O H H H H C H H H H H C H H O H O H C H H H
charge: -0.546231 0.097210 -1.100016 0.310713 0.418420 -0.169661 -0.029722 0.151001 0.138028 0.135838 0.109193 -0.568185 0.165548 0.107530 -0.114632 -0.324319 0.149886 0.181745 0.153935 0.140210 -0.530564 0.381696 0.127654 0.135057 0.137894 -0.384410 0.159819 0.155842 0.148357 0.131330 0.134402 -0.179513 0.147888 0.141327 -0.488382 0.354032 -0.542796 0.403220 -0.285984 0.120954 0.154248 0.171439
chargesum: 0.00000
title: Mulliken charges with hydrogens summed into heavy atoms:
elementType: C C C C C C C C C C C C O C C O O C
charge: -0.257202 0.233048 -1.100016 0.310713 0.527613 -0.035259 0.101608 -0.264743 0.242587 -0.114632 -0.046780 0.475890 -0.148868 0.079608 0.109702 -0.134350 -0.139576 0.160657
chargesum: -0.00000
1716.lowfreq: -8.2623 -0.0006 -0.0005 -0.0004 1.2721 8.2360 75.9839 84.4466 116.4920
frequency: 75.9746 84.4300 116.4919 134.4248 156.5412 199.1591 228.8685 234.3536 262.0324 277.9442 285.8232 292.4316 303.6549 318.4440 323.4977 329.0315 350.6269 356.5924 383.3089 401.1714 410.3314 431.1729 452.8250 464.8988 515.4595 526.1120 551.4529 583.2099 624.2038 638.5518 662.7442 683.4453 703.7932 736.3269 768.5048 811.3988 845.1374 869.5620 882.7446 892.1321 912.0747 927.5217 939.9107 946.1749 961.6452 976.7317 983.4212 989.8757 1000.5248 1016.6009 1025.6801 1029.1947 1038.1899 1050.9703 1073.4159 1097.7673 1121.2638 1131.0946 1133.8144 1150.2434 1165.8012 1181.4210 1190.4367 1205.4248 1226.1693 1244.6038 1263.8927 1268.7897 1281.9227 1285.5725 1297.9154 1325.8569 1326.7683 1335.2499 1345.5010 1364.8745 1371.9115 1378.5332 1388.1240 1390.8153 1406.7146 1408.5520 1415.8548 1424.3780 1430.5138 1457.3910 1490.2088 1494.4344 1495.7871 1497.2354 1500.2745 1509.1895 1521.2199 1524.9533 1535.9371 1740.6773 2961.5180 3024.8912 3039.3075 3042.8778 3047.2710 3051.6601 3061.4647 3063.6087 3078.7490 3081.2833 3083.1318 3092.9519 3093.3062 3102.0072 3104.3329 3110.4892 3112.8315 3130.6993 3138.8699 3164.2316 3166.2314 3642.6643 3807.8536 3812.9314
redmass: 5.3840 4.9881 3.5530 4.1109 2.7944 2.2478 2.8864 1.3947 2.7216 1.5751 2.3899 3.1681 1.2981 3.6095 1.9613 2.8908 1.3472 2.9713 2.0057 2.8553 2.3999 2.7695 2.9518 2.8640 3.5514 3.0328 2.1270 3.0842 2.1259 1.6511 3.7253 2.6024 4.2370 2.4266 2.2921 3.0367 2.5236 2.1176 2.4679 2.3454 2.2910 1.8354 1.8537 2.0918 1.7858 2.1452 2.9812 2.8563 1.4464 1.9217 2.4335 4.7027 2.5393 2.3470 2.5734 1.9599 2.4936 1.9400 1.8632 2.0931 1.7700 1.9092 2.2972 1.2401 1.4103 1.2577 1.6414 1.6110 1.3659 1.6259 1.1519 1.4353 1.4053 1.5348 1.3547 1.3345 1.2780 1.2850 1.2363 1.2454 1.2524 1.2733 1.2295 1.2175 1.3314 1.6047 1.0579 1.0672 1.0542 1.0558 1.0632 1.0807 1.0719 1.0775 1.0825 7.3436 1.0828 1.0355 1.0637 1.0432 1.0662 1.0617 1.0824 1.0801 1.0685 1.0703 1.0980 1.1016 1.0986 1.1035 1.1068 1.1027 1.0971 1.1008 1.0850 1.0953 1.0967 1.0661 1.0665 1.0662
irintensity: 10.5909 2.5440 1.1741 3.2162 5.7278 2.9566 2.9921 7.7606 4.7047 6.3288 12.1849 2.5964 155.8839 19.0516 15.5997 7.1499 145.5698 14.1405 52.8465 3.8448 4.8773 1.4685 4.8130 1.2399 9.7697 7.6532 2.6926 19.7805 51.8281 102.7015 0.0110 64.3347 1.3524 16.4903 20.8188 3.3997 10.6489 0.6883 11.9511 25.6013 6.3224 0.9475 17.3124 10.2981 30.9047 36.5856 49.7542 82.4075 6.9019 47.0309 6.5707 176.7788 39.2486 19.5876 74.1037 14.9512 4.7842 5.9906 2.1708 14.6830 22.4420 7.5874 1.5655 13.7801 33.7853 0.3080 1.8268 20.6291 7.6224 5.3054 99.6598 0.4193 6.1450 2.1716 0.7312 34.6664 24.7084 13.0353 17.3764 12.0760 35.6507 1.0937 19.2757 23.3949 4.1370 53.1618 5.3861 4.1327 9.0702 9.7496 12.2936 9.3747 7.1892 17.0051 18.3032 10.4437 95.2775 49.4167 16.4197 76.0166 84.0242 45.3058 110.7909 28.5155 136.8774 12.9848 43.8916 81.5839 52.1291 67.6491 31.4656 60.0347 58.7621 66.4010 20.3184 55.2822 47.2589 350.3195 60.6312 39.7059
temp: 298.150 k
press: 1.00000 atm
elementType: 6 6 6 6 6 6 6 1 1 1 1 6 1 6 6 6 1 6 1 1 8 1 1 1 1 6 1 1 1 1 1 6 1 1 8 1 8 1 6 1 1 1
symmnumber: 1
zpe: 983228.7 jmol-1
zpe.correction: 0.374492 hartree
zpe.thermalcorrener: 0.391226 hartree
zpe.thermalcorrenthalpy: 0.392170 hartree
zpe.thermalcorrgfe: 0.333083 hartree
zpe.sumelectzpe: -811.415327 hartree
zpe.sumelectthermal: -811.398593 hartree
zpe.sumelectthermalent: -811.397649 hartree
zpe.sumelectthermalfe: -811.456736 hartree
dipole: 2.0862 0.6534 3.1918
dipole: 3.8687
quadrupole: -133.1161 -111.3084 -109.6504
quadrupole: -7.2820 -1.1723 0.5281
quadrupole: -15.0911 6.7166 8.3745 -7.2820 -1.1723 0.5281
hfenergy: -811.7898192 hartree
pointgroup: C01 [X(C15H24O3)]
dipole: 0.8131785 0.2835399 1.2549819 debye
polarizability: 245.6028357|4.0633305|250.1917415|-0.2679893|-0.8618143|215.5523642 unknown
InChI: InChI=1/15C.3O.24H
charge 0 multiplicity 1
42 atoms
C  -0.22527617 1.5556435 1.30793892
C  -0.03525462 0.02322769 1.53997276
C  -0.66979891 -0.84574034 0.40283607
C  -0.77944983 1.948598 -0.09633973
C  -2.21622918 -0.71474155 0.15552871
C  -2.28657452 1.80497649 -0.01130003
C  -2.89409125 0.62715463 0.12310704
H  -0.90088789 1.97090147 2.06192424
H  0.73704812 2.05508076 1.46523467
H  -0.41236768 -0.25529826 2.53018167
H  -2.69154462 -1.26559034 0.98359077
C  -0.23758155 1.01941207 -1.23831737
H  -1.04583972 0.86498467 -1.95761688
C  0.24895522 -0.37355509 -0.76671453
C  1.71175192 -0.39920713 -0.15791356
C  1.47180915 -0.31041043 1.38771093
H  1.73960226 -1.24616082 1.88522328
C  -0.48136286 -2.34670163 0.77956453
H  -1.16724133 -2.58941255 1.59609274
H  0.52175671 -2.57235766 1.13311442
O  -0.82029264 -3.26553798 -0.28256381
H  -0.09437415 -3.29171205 -0.9218825
H  2.08391566 0.46102108 1.86781574
H  0.20278613 -1.0475861 -1.62796291
H  0.55195343 1.53225661 -1.79251238
C  -0.42925062 3.41519157 -0.3988337
H  -0.85981888 3.72734195 -1.35749344
H  -0.82074582 4.08010168 0.38018582
H  0.65482213 3.55979174 -0.45200435
H  -3.97914526 0.5768345 0.19287361
H  -2.88036851 2.71873875 -0.01589489
C  2.58006045 0.78773307 -0.63868756
H  2.64741653 0.78576047 -1.73110056
H  2.14664445 1.7432924 -0.32722389
O  3.94015028 0.71705165 -0.18487956
H  3.95354931 0.79721474 0.77885553
O  -2.59414962 -1.36316111 -1.08366585
H  -2.18923738 -2.24994594 -1.06344252
C  2.45601597 -1.68596964 -0.57183036
H  1.90670113 -2.59446998 -0.31632902
H  2.62868312 -1.6960392 -1.65424685
H  3.42851204 -1.74461567 -0.07607219
