program: Gaussian 16
title: Title
version: ES64L-G16RevC.01
frameworkgroup: C1[X(C15H24O3)]
method: RB3LYP
basis: 6-31+G(d,p)
operation: Freq
keyword: #N
keyword: Geom=AllCheck
keyword: Guess=TCheck
keyword: SCRF=Check
keyword: GenChk
keyword: RB3LYP/6-31+G(d,p)
keyword: Freq
converged: YES YES NO YES
title: Mulliken charges:
elementType: C C C C C C C H H H H C H C C C H C H H O H H H H C H H H H H C H H O H O H C H H H
charge: -0.839626 0.142149 -1.264328 0.695823 0.944686 -0.160650 -0.133799 0.139593 0.153922 0.128837 0.131624 -0.879125 0.148557 0.349890 0.243918 -0.548293 0.140476 0.005068 0.121063 0.134247 -0.513689 0.396161 0.145787 0.137095 0.142861 -0.432016 0.147121 0.167878 0.149535 0.130764 0.134030 -0.204199 0.133394 0.138300 -0.633227 0.404780 -0.579304 0.403989 -0.391711 0.170817 0.146291 0.151309
chargesum: -0.00000
title: Mulliken charges with hydrogens summed into heavy atoms:
elementType: C C C C C C C C C C C C O C C O O C
charge: -0.546111 0.270986 -1.264328 0.695823 1.076310 -0.026619 -0.003035 -0.587707 0.486985 0.243918 -0.262030 0.260378 -0.117527 0.032518 0.067496 -0.228447 -0.175315 0.076706
1716.lowfreq: -9.5251 -2.7263 -0.0008 -0.0001 0.0008 9.6672 71.8191 120.9943 130.2994
frequency: 71.7976 120.9942 130.2991 155.2231 175.3163 192.2342 212.5959 234.4325 245.4174 256.8263 272.2796 281.3800 290.5825 305.2746 307.2965 326.2466 339.4465 363.8182 385.3404 410.1497 417.7223 428.3283 458.4258 488.2328 514.3484 524.5451 552.2495 568.4233 599.7149 614.9782 645.9315 678.9140 700.4561 729.6825 769.6000 809.9446 841.5701 867.6829 886.2610 901.3565 902.9476 914.8383 933.4954 941.7993 953.1874 985.5501 986.6746 1001.9332 1009.5688 1025.3470 1034.1590 1051.7501 1056.4968 1062.5389 1075.4019 1100.6902 1114.3771 1122.5585 1141.5556 1156.9047 1160.4061 1187.1275 1196.7559 1208.2412 1231.7139 1248.4638 1253.1036 1261.4638 1279.1003 1284.2482 1304.2116 1320.7731 1328.2130 1329.6162 1336.7878 1345.7833 1351.8161 1366.6506 1377.8736 1382.8810 1405.0660 1418.0986 1426.3487 1434.8515 1453.5699 1460.5530 1490.6134 1493.4730 1495.4986 1504.2074 1505.9589 1506.8954 1516.9927 1526.1448 1539.9094 1738.6917 2983.9283 2993.4917 2999.6236 3021.5169 3027.3247 3031.4024 3040.6534 3054.8356 3059.4378 3068.7226 3080.6156 3082.8073 3084.9759 3103.8902 3114.7786 3118.9201 3128.9132 3135.8285 3153.4853 3163.9553 3172.1569 3645.4097 3807.0685 3828.0286
redmass: 4.9502 3.7000 4.7405 4.6693 3.2324 1.7135 1.6430 2.2100 1.5320 2.5305 2.5395 1.6236 1.3474 1.8726 2.9425 3.0735 2.1106 2.8619 2.9175 2.7541 2.5725 2.6328 2.8407 3.4039 3.5506 3.0486 2.3004 2.9119 2.0160 1.6156 3.9075 2.8770 4.2841 2.4708 2.2979 3.0119 2.6202 2.1898 2.3691 2.3432 2.3486 2.2819 2.1502 3.9845 1.8366 1.7447 2.3500 1.4799 1.7757 2.3736 1.9085 3.0800 2.8673 2.8681 2.8222 2.2805 2.2562 2.2552 2.1545 1.6220 1.5011 2.6280 1.9547 1.2501 1.2581 1.3382 1.1952 1.3573 1.4679 1.4275 1.3874 1.3303 1.4342 1.2991 1.5487 1.3512 1.2695 1.3758 1.2702 1.4378 1.2667 1.2147 1.6141 1.3979 1.2939 1.2033 1.0666 1.0787 1.0639 1.0768 1.0571 1.0502 1.0721 1.0770 1.0769 7.1910 1.0795 1.0559 1.0798 1.0386 1.0462 1.1045 1.0787 1.0696 1.0702 1.0693 1.1018 1.0870 1.0965 1.1011 1.0992 1.0955 1.0838 1.0980 1.0976 1.0931 1.0885 1.0660 1.0670 1.0669
irintensity: 4.6486 3.4064 10.2072 5.2332 24.8446 101.6958 57.5433 3.2433 3.2804 22.3574 6.5599 7.6711 84.7822 32.3463 3.6943 7.1929 3.2154 1.3717 4.1836 7.1107 1.1793 5.1085 0.4817 4.9877 8.9982 5.7083 26.4844 14.3856 53.1919 135.3524 18.1978 35.9471 1.9789 14.0525 32.6947 11.8163 13.9667 5.4592 10.1705 11.0665 22.2867 4.4569 9.7060 146.2249 5.4860 10.4753 3.3772 5.2011 13.7709 27.6781 47.4883 127.3497 13.0379 34.8946 137.9230 4.2001 3.3948 6.2736 30.1659 35.6964 39.2450 17.7206 0.3307 6.6676 7.4328 7.5095 53.6154 29.4586 5.7349 3.2354 30.6241 1.5918 4.3701 4.9562 6.6372 2.5560 7.2723 0.7776 4.4729 5.3346 6.4628 8.6227 28.3363 7.2384 2.1420 99.5491 5.5798 6.7314 2.0018 1.7820 15.2085 3.6096 7.4393 25.5719 13.8788 12.1592 16.5223 97.5863 171.4722 72.9881 74.3349 92.5046 27.4913 112.6087 51.7401 107.1736 66.3404 17.3825 114.7575 12.7439 47.9355 40.4047 23.6731 32.1673 71.1748 28.9185 32.6695 362.1208 61.2672 60.1477
temp: 298.150 k
press: 1.00000 atm
elementType: 6 6 6 6 6 6 6 1 1 1 1 6 1 6 6 6 1 6 1 1 8 1 1 1 1 6 1 1 1 1 1 6 1 1 8 1 8 1 6 1 1 1
symmnumber: 1
zpe: 982259.5 jmol-1
zpe.correction: 0.374123 hartree
zpe.thermalcorrener: 0.390885 hartree
zpe.thermalcorrenthalpy: 0.391829 hartree
zpe.thermalcorrgfe: 0.333019 hartree
zpe.sumelectzpe: -811.414303 hartree
zpe.sumelectthermal: -811.397541 hartree
zpe.sumelectthermalent: -811.396597 hartree
zpe.sumelectthermalfe: -811.455408 hartree
dipole: 1.8962 2.2570 0.4562
dipole: 2.9829
quadrupole: -102.7362 -113.6326 -112.5787
quadrupole: -16.8537 -6.4115 -0.8459
quadrupole: 6.9130 -3.9834 -2.9295 -16.8537 -6.4115 -0.8459
hfenergy: -811.7884263 hartree
pointgroup: C01 [X(C15H24O3)]
dipole: 0.7701344 0.8674191 0.1781234 debye
polarizability: 255.8266067|4.8441376|245.6545506|-0.8895672|0.6606033|216.8321887 unknown
InChI: InChI=1/15C.3O.24H
charge 0 multiplicity 1
42 atoms
C  1.00584869 1.11164968 1.34374499
C  -0.00974413 -0.05478329 1.54488779
C  -1.07188119 -0.14083586 0.40120899
C  0.99485823 1.7607037 -0.07620049
C  -1.96475192 1.11970616 0.17388517
C  -0.10180115 2.80608461 -0.07334672
C  -1.39311737 2.50340507 0.05402506
H  0.8170047 1.90406981 2.07544139
H  2.01068119 0.73171757 1.54132577
H  -0.48023872 0.02987546 2.53157251
H  -2.66683124 1.14584975 1.01995103
C  0.69726621 0.71973108 -1.20930371
H  0.13026981 1.23150056 -1.99321626
C  -0.10375239 -0.52924514 -0.76346717
C  0.78132547 -1.68799295 -0.14902784
C  0.73250573 -1.41189834 1.39051547
H  0.2104362 -2.21803803 1.9139026
C  -2.10346244 -1.25804932 0.76801127
H  -2.77234494 -0.85230797 1.54233029
H  -1.6222339 -2.12859236 1.20497928
O  -2.86996698 -1.7512615 -0.33388508
H  -3.14661301 -0.96337138 -0.83706768
H  1.73395631 -1.35890303 1.8227509
H  -0.65046167 -0.91493016 -1.62844802
H  1.6381592 0.41064688 -1.66701043
C  2.34167505 2.45482878 -0.33928143
H  2.54947484 3.20825245 0.43081264
H  3.15040227 1.72077695 -0.33795767
H  2.33241959 2.96326947 -1.3114802
H  -2.13977514 3.29733779 0.07278603
H  0.19609503 3.85223238 -0.14350033
C  2.23140998 -1.76532827 -0.67037324
H  2.63659181 -2.75028381 -0.39974842
H  2.22461249 -1.70096172 -1.768504
O  3.07532001 -0.74628473 -0.11812376
H  3.96348546 -0.86051497 -0.48060092
O  -2.75635945 0.84021279 -1.03321487
H  -3.45867706 1.50248888 -1.10179878
C  0.18996509 -3.06830104 -0.53291996
H  -0.89450086 -3.10154544 -0.4401412
H  0.42501329 -3.30338688 -1.57885321
H  0.61906291 -3.85940264 0.0926502
