program: Gaussian 16
title: Title
version: ES64L-G16RevC.01
frameworkgroup: C1[X(C15H24O3)]
method: RB3LYP
basis: 6-31+G(d,p)
operation: Freq
keyword: #N
keyword: Geom=AllCheck
keyword: Guess=TCheck
keyword: SCRF=Check
keyword: GenChk
keyword: RB3LYP/6-31+G(d,p)
keyword: Freq
converged: YES YES NO YES
title: Mulliken charges:
elementType: C C C C C C C H H H H C H C C C H C H H O H H H H C H H H H H C H H O H O H C H H H
charge: -0.541647 0.089098 -1.198569 0.321706 0.459496 -0.193338 -0.079803 0.148984 0.135564 0.133138 0.105310 -0.542378 0.158380 0.275122 -0.063576 -0.437882 0.147618 0.394512 0.143986 0.134631 -0.580553 0.407811 0.139587 0.140179 0.157744 -0.370719 0.153703 0.147618 0.157839 0.129763 0.133046 -0.245735 0.144724 0.141887 -0.540494 0.369889 -0.561152 0.405038 -0.374356 0.157911 0.141080 0.154839
chargesum: -0.00000
title: Mulliken charges with hydrogens summed into heavy atoms:
elementType: C C C C C C C C C C C C O C C O O C
charge: -0.257099 0.222236 -1.198569 0.321706 0.564807 -0.060292 0.049960 -0.226254 0.415301 -0.063576 -0.150677 0.673129 -0.172742 0.088440 0.040876 -0.170605 -0.156114 0.079474
1716.lowfreq: -7.7679 -0.0008 -0.0005 -0.0004 7.7679 13.2506 71.8012 90.0986 119.1025
frequency: 71.7819 90.0942 119.0767 127.8295 166.7858 183.6258 227.5911 232.7416 245.2509 276.5872 280.8022 282.7820 289.7616 306.5810 325.7493 331.9823 343.9222 349.9804 386.8762 395.1510 412.9108 442.8942 453.9126 473.5951 512.1407 520.8587 558.5780 589.8205 606.4481 621.2551 653.8297 690.1424 710.6122 725.7941 766.9315 817.1034 849.4088 868.8415 888.5719 901.7049 908.6153 918.9299 932.4853 944.8103 967.0802 978.6798 986.3279 993.7333 1001.3852 1013.9150 1034.6625 1039.9624 1041.8050 1055.0398 1077.5694 1100.7196 1111.5899 1122.8216 1142.1173 1155.4666 1172.3342 1184.8012 1190.1282 1210.3459 1238.2033 1251.1550 1258.0099 1268.6550 1276.0940 1283.3995 1297.0070 1304.3440 1324.9569 1331.3320 1334.2471 1346.2134 1364.0132 1375.2067 1380.2894 1386.4689 1411.2565 1413.3144 1424.9607 1427.8127 1442.7525 1461.2851 1489.7121 1495.6546 1496.7769 1501.2980 1502.8993 1510.3809 1528.7859 1531.4107 1545.8815 1740.4727 2957.7826 3013.5688 3023.5790 3030.8340 3034.4312 3040.1857 3048.9911 3061.4849 3071.6578 3080.5749 3088.3324 3091.0393 3092.5414 3098.2994 3101.5764 3121.8424 3128.6788 3136.1608 3143.2474 3154.7449 3163.8396 3633.7136 3828.2652 3831.5635
redmass: 5.7937 4.5051 3.9036 4.5342 3.3478 2.5387 1.5515 1.5278 2.1253 1.7454 2.5820 1.8946 1.4985 1.5257 2.4539 2.8176 3.3486 2.7286 2.5672 2.3914 2.9460 2.7026 2.8988 2.9100 3.2256 2.9386 2.1446 2.5648 2.5048 1.5972 3.6681 3.6504 3.2935 2.6141 2.1362 3.2705 2.5150 2.2761 2.3125 2.0335 2.3795 2.1743 2.1417 2.0186 1.7255 2.2269 3.1277 2.3743 1.5187 1.9419 2.6187 3.0250 3.5194 2.1506 2.3680 2.2822 1.7490 2.1084 1.9643 1.6020 2.2237 1.7743 2.2487 1.5016 1.2703 1.3877 1.2835 1.6820 1.3901 1.3757 1.2354 1.2186 1.4810 1.3710 1.5145 1.3928 1.3587 1.3277 1.2690 1.3179 1.2109 1.2905 1.2294 1.3307 1.3090 1.5961 1.0541 1.0588 1.0521 1.0750 1.0804 1.0568 1.0732 1.0757 1.0825 7.3473 1.0828 1.0716 1.0356 1.0436 1.0711 1.0635 1.0739 1.0776 1.0689 1.1006 1.1013 1.1023 1.1011 1.0852 1.1020 1.0962 1.0936 1.0849 1.0950 1.0896 1.0966 1.0662 1.0668 1.0665
irintensity: 3.4477 2.3856 1.4436 0.7898 7.4479 6.8267 1.2112 101.4871 59.9989 1.9045 1.2305 65.8350 83.0895 20.2935 3.5667 26.9233 1.1996 6.5516 2.2178 4.1279 0.3870 0.7157 8.2842 8.1467 16.7103 9.0567 8.0415 56.4307 37.6153 135.7550 4.1254 32.7864 11.9327 5.8047 24.3276 5.0641 2.0817 7.9183 26.3102 1.4839 9.1839 0.8605 21.7883 16.6944 16.2392 46.3087 29.5318 78.0601 10.4480 34.2652 15.0473 55.4293 125.3967 23.8785 96.6589 7.8164 8.9232 9.1921 1.6710 9.5804 8.2815 10.4474 2.5117 9.2554 18.3397 32.2680 29.2144 6.8803 6.2090 5.6978 78.1954 57.7128 0.7845 1.9099 1.2976 0.5459 6.4061 2.5391 2.3474 18.0559 25.1749 9.5639 9.4084 12.3547 2.3354 67.7128 6.0348 7.5511 3.8812 7.0547 7.3101 15.2723 8.0273 23.2562 23.5914 11.0265 93.0268 70.9305 53.5006 92.2910 56.7254 53.5404 30.5850 165.4476 28.7998 67.0682 35.3645 60.7587 74.1623 52.2987 67.6695 34.1159 36.2229 23.2572 45.2533 43.2770 62.5102 378.5525 82.6079 55.4547
temp: 298.150 k
press: 1.00000 atm
elementType: 6 6 6 6 6 6 6 1 1 1 1 6 1 6 6 6 1 6 1 1 8 1 1 1 1 6 1 1 1 1 1 6 1 1 8 1 8 1 6 1 1 1
symmnumber: 1
zpe: 982773.0 jmol-1
zpe.correction: 0.374318 hartree
zpe.thermalcorrener: 0.391146 hartree
zpe.thermalcorrenthalpy: 0.392090 hartree
zpe.thermalcorrgfe: 0.332822 hartree
zpe.sumelectzpe: -811.416512 hartree
zpe.sumelectthermal: -811.399684 hartree
zpe.sumelectthermalent: -811.398740 hartree
zpe.sumelectthermalfe: -811.458008 hartree
dipole: 2.3745 -3.3158 5.2285
dipole: 6.6310
quadrupole: -114.1580 -98.9858 -118.0783
quadrupole: -5.1430 -4.4704 -1.9707
quadrupole: -3.7506 11.4215 -7.6709 -5.1430 -4.4704 -1.9707
hfenergy: -811.7908301 hartree
pointgroup: C01 [X(C15H24O3)]
dipole: 1.0097585 -1.245413 2.0579785 debye
polarizability: 242.2748409|2.9984614|252.7783285|1.9297203|0.7918238|218.172529 unknown
InChI: InChI=1/15C.3O.24H
charge 0 multiplicity 1
42 atoms
C  -0.48600731 1.45494646 1.45583258
C  -0.20949785 -0.06986365 1.6357639
C  -0.61380694 -0.91459019 0.3800067
C  -0.85677453 1.89079124 0.00535069
C  -2.11372267 -0.87436125 -0.08980243
C  -2.34471612 1.64083464 -0.14412678
C  -2.87667576 0.41950556 -0.15782588
H  -1.29573174 1.77386368 2.11950615
H  0.4001868 2.01088735 1.78116512
H  -0.69426145 -0.43191022 2.54927369
H  -2.66307264 -1.50600289 0.62754377
C  -0.08020166 1.07270698 -1.0838875
H  -0.75294464 0.9265463 -1.93341753
C  0.42188694 -0.31875906 -0.62616836
C  1.78067152 -0.29229056 0.18153502
C  1.32627876 -0.28771308 1.68101536
H  1.59653315 -1.22326537 2.17789944
C  -0.36962309 -2.4102823 0.71834656
H  -1.16101 -2.74483152 1.40117963
H  0.5809729 -2.57909681 1.21950791
O  -0.40155987 -3.20143468 -0.49137385
H  -0.43962028 -4.13754349 -0.25320479
H  1.81635317 0.50446591 2.25746023
H  0.53238009 -0.95096997 -1.51004899
H  0.75772217 1.65798963 -1.46536034
C  -0.57837292 3.39318216 -0.17004114
H  -1.12978588 3.98463652 0.57080385
H  0.48790319 3.61274877 -0.05159348
H  -0.88390382 3.73074224 -1.16741653
H  -3.953695 0.29432344 -0.25507317
H  -2.99866412 2.51127012 -0.19601618
C  2.65048938 0.96389109 -0.04692802
H  2.10657337 1.87086177 0.22253399
H  3.52339333 0.90310071 0.61858457
O  3.08250862 1.16502307 -1.40057529
H  3.74469615 0.4972999 -1.62109445
O  -2.25583557 -1.46965929 -1.4036813
H  -1.75246049 -2.30502276 -1.38259761
C  2.6502907 -1.51849802 -0.16822848
H  2.10761488 -2.45871142 -0.06347165
H  2.98797973 -1.4751703 -1.21023173
H  3.53527352 -1.56107872 0.47796534
