program: Gaussian 16
title: Title
version: ES64L-G16RevC.01
frameworkgroup: C1[X(C15H24O3)]
method: RB3LYP
basis: 6-31+G(d,p)
operation: Freq
keyword: #N
keyword: Geom=AllCheck
keyword: Guess=TCheck
keyword: SCRF=Check
keyword: GenChk
keyword: RB3LYP/6-31+G(d,p)
keyword: Freq
converged: YES YES NO YES
title: Mulliken charges:
elementType: C C C C C C C H H H H C H C C C H C H H O H H H H C H H H H H C H H O H O H C H H H
charge: -0.539706 0.073911 -1.153912 0.340959 0.457064 -0.186191 -0.070869 0.150208 0.137083 0.134347 0.106503 -0.382886 0.168879 0.009617 0.027275 -0.466851 0.148757 0.393506 0.144846 0.137697 -0.580506 0.408718 0.139947 0.151087 0.100609 -0.418115 0.155750 0.148813 0.159270 0.131004 0.134551 -0.267482 0.136049 0.145866 -0.498285 0.353126 -0.561848 0.405474 -0.338108 0.148853 0.152157 0.162833
chargesum: -0.00000
title: Mulliken charges with hydrogens summed into heavy atoms:
elementType: C C C C C C C C C C C C O C C O O C
charge: -0.252415 0.208257 -1.153912 0.340959 0.563566 -0.051639 0.060135 -0.113399 0.160704 0.027275 -0.178147 0.676049 -0.171789 0.045719 0.014434 -0.145159 -0.156374 0.125736
1716.lowfreq: -5.9148 0.0002 0.0004 0.0007 3.6962 9.0594 72.3742 89.9329 116.1485
frequency: 72.3597 89.9299 116.1288 133.7626 172.8841 185.0779 220.4695 239.5852 248.7631 275.9451 278.2383 280.6183 286.2446 306.0953 324.6093 329.3328 345.3828 346.7985 386.6453 397.7509 413.4835 447.2744 451.9759 466.7707 512.9970 518.2228 556.2914 588.8613 605.7305 620.9158 654.1724 689.7948 711.0419 722.3226 767.0577 817.3621 850.4410 868.8016 891.6920 900.9405 902.5539 921.2751 938.2681 949.4893 966.3719 976.4174 989.2907 993.0851 1000.8309 1015.6842 1032.9201 1036.1480 1044.7875 1055.3109 1078.8512 1100.8222 1117.6647 1128.4797 1136.5155 1161.7066 1170.6255 1179.9160 1189.4010 1212.5482 1238.4930 1254.5571 1258.9891 1269.5170 1279.1482 1283.3085 1297.0476 1304.7075 1326.4520 1330.9438 1335.8108 1344.1171 1364.1342 1373.4408 1378.8903 1386.7469 1409.0130 1412.9649 1426.2822 1429.2012 1444.5611 1461.6389 1489.1772 1494.5998 1495.8942 1497.9171 1500.4961 1502.2978 1524.8470 1529.9625 1544.1670 1741.0207 2961.5247 3024.8293 3035.5603 3037.3105 3039.5617 3042.3309 3050.5680 3062.3559 3065.8031 3081.8781 3090.6743 3090.9715 3093.0908 3093.9340 3100.8420 3104.2731 3107.7304 3138.4579 3145.2121 3156.4060 3165.4729 3634.7409 3814.2245 3828.0754
redmass: 5.7238 4.5976 3.8225 4.2686 3.5646 2.0926 1.6967 1.7588 1.2999 2.8873 1.3834 1.5494 2.9940 1.7722 2.4558 3.3881 3.2453 2.6155 2.5209 2.3391 3.1296 2.7571 2.8023 2.7201 3.1785 3.1031 2.1385 2.6148 2.3015 1.6518 3.5808 3.5786 3.3620 2.6048 2.1082 3.3140 2.6034 2.1959 2.4631 2.0820 2.2913 2.2348 2.1318 2.1587 1.7056 2.0953 2.9412 2.9353 1.4367 1.8766 2.9611 3.6974 2.6925 2.1395 2.3734 2.4393 2.0150 1.7651 1.9532 1.6442 2.1161 1.6810 2.4909 1.5336 1.2643 1.3887 1.2775 1.6686 1.3939 1.3941 1.1916 1.2454 1.4296 1.4036 1.5090 1.3349 1.3137 1.2850 1.2975 1.3678 1.2117 1.3101 1.2184 1.3396 1.3144 1.5855 1.0693 1.0668 1.0573 1.0570 1.0613 1.0702 1.0719 1.0764 1.0834 7.3488 1.0829 1.0355 1.0685 1.0537 1.0578 1.0603 1.0735 1.0745 1.0660 1.1003 1.1001 1.0940 1.1018 1.1006 1.1003 1.1008 1.0973 1.0849 1.0974 1.0903 1.0968 1.0661 1.0661 1.0669
irintensity: 4.4294 1.8144 3.0524 3.4494 3.9684 4.4975 7.4246 0.1114 119.4933 20.5720 56.3330 59.5578 35.8846 13.0077 5.1091 7.2719 1.7930 3.8667 3.7018 6.9346 1.5279 4.9002 7.9118 2.9149 19.0032 7.6628 8.4744 41.9128 42.3589 147.3184 4.9232 32.8120 8.2303 4.6278 25.9265 5.0053 9.3154 5.5389 10.0473 14.7789 11.4606 1.1581 16.6791 19.0560 9.1393 25.5473 11.9080 83.6894 2.5010 24.5957 129.6802 116.1827 31.4292 12.3837 97.6859 10.0973 16.6262 11.5380 4.9002 4.9508 2.4551 5.9737 0.6168 9.0991 50.0330 27.1461 14.5000 3.2930 0.2600 8.0663 89.9357 39.1285 6.8126 1.9873 0.8959 2.1436 2.8836 5.2823 11.6503 14.7944 40.6601 7.7707 22.7042 9.2190 2.6560 65.5281 0.7908 18.5466 10.6366 2.5535 8.5734 0.9245 13.2973 21.9019 24.3022 10.5658 90.0281 44.9310 88.6848 45.9638 33.5567 60.7143 35.8838 187.1755 57.4500 71.9106 50.6631 50.4474 58.9364 64.4316 13.7428 78.5469 59.8045 20.3609 42.6598 42.8950 60.2611 375.5596 45.0817 84.4989
temp: 298.150 k
press: 1.00000 atm
elementType: 6 6 6 6 6 6 6 1 1 1 1 6 1 6 6 6 1 6 1 1 8 1 1 1 1 6 1 1 1 1 1 6 1 1 8 1 8 1 6 1 1 1
symmnumber: 1
zpe: 982659.9 jmol-1
zpe.correction: 0.374275 hartree
zpe.thermalcorrener: 0.391101 hartree
zpe.thermalcorrenthalpy: 0.392045 hartree
zpe.thermalcorrgfe: 0.332803 hartree
zpe.sumelectzpe: -811.416177 hartree
zpe.sumelectthermal: -811.399351 hartree
zpe.sumelectthermalent: -811.398407 hartree
zpe.sumelectthermalfe: -811.457650 hartree
dipole: 0.4310 1.7645 4.5821
dipole: 4.9290
quadrupole: -130.0126 -97.1810 -114.6720
quadrupole: -3.4258 1.1342 5.4729
quadrupole: -16.0574 16.7742 -0.7168 -3.4258 1.1342 5.4729
hfenergy: -811.7904524 hartree
pointgroup: C01 [X(C15H24O3)]
dipole: 0.1068084 0.7014013 1.8047532 debye
polarizability: 242.3675293|2.133789|252.8137563|-2.0721148|-0.678022|217.8546979 unknown
InChI: InChI=1/15C.3O.24H
charge 0 multiplicity 1
42 atoms
C  0.62379188 -1.413702 1.45613253
C  0.20537043 0.07734543 1.63826362
C  0.52654379 0.96047295 0.3846247
C  1.03141406 -1.808656 0.00529619
C  2.02078586 1.06157996 -0.09600047
C  2.48856938 -1.41996318 -0.15026959
C  2.90279576 -0.15404014 -0.16569917
H  1.46097953 -1.65681225 2.11763667
H  -0.20633515 -2.05130078 1.77946725
H  0.6555899 0.48189233 2.55140732
H  2.51237718 1.74533644 0.61501274
C  0.17849437 -1.0624492 -1.07835484
H  0.82656138 -0.85634508 -1.93392321
C  -0.45467368 0.27754606 -0.62112414
C  -1.80611766 0.13363034 0.18937829
C  -1.34374789 0.14981413 1.68644661
H  -1.69917146 1.05023597 2.1944306
C  0.14850301 2.42548221 0.73297499
H  0.90647659 2.82298658 1.41988147
H  -0.81419119 2.504576 1.23306417
O  0.11284942 3.22500036 -0.47060634
H  0.06594842 4.15911074 -0.22626504
H  -1.75590753 -0.69179721 2.25348994
H  -0.61882231 0.89838414 -1.50525473
H  -0.58719566 -1.74756885 -1.45276045
C  0.89303957 -3.32968862 -0.17534594
H  1.50125055 -3.86824566 0.5609717
H  -0.14750716 -3.64759015 -0.05081992
H  1.22380493 -3.63463573 -1.17512142
H  3.96274455 0.07211462 -0.26675138
H  3.2204696 -2.22553069 -0.20440992
C  -2.57324983 -1.18393385 -0.05597554
H  -1.95447105 -2.05247131 0.19997281
H  -3.44364781 -1.20387653 0.60753985
O  -3.11578898 -1.33166448 -1.37614026
H  -2.39401355 -1.31866292 -2.0192761
O  2.09453685 1.66172862 -1.41289515
H  1.52529558 2.45350055 -1.38499989
C  -2.77537419 1.28652437 -0.14859361
H  -3.62498403 1.28425402 0.54476423
H  -2.29602484 2.264949 -0.09909131
H  -3.1681976 1.1638928 -1.16213427
