program: Gaussian 16
title: Title
version: ES64L-G16RevC.01
frameworkgroup: C1[X(C15H24O3)]
method: RB3LYP
basis: 6-31+G(d,p)
operation: Freq
keyword: #N
keyword: Geom=AllCheck
keyword: Guess=TCheck
keyword: SCRF=Check
keyword: GenChk
keyword: RB3LYP/6-31+G(d,p)
keyword: Freq
converged: YES YES NO YES
title: Mulliken charges:
elementType: C C C C C C C H H H H C H C C C H C H H O H H H H C H H H H H C H H O H O H C H H H
charge: -0.526640 0.127516 -0.862463 0.394928 -0.199497 -0.197526 0.047278 0.148628 0.135991 0.143440 0.152999 -0.587448 0.136782 0.240128 -0.012241 -0.488026 0.152990 0.324833 0.120286 0.156131 -0.559381 0.389995 0.137438 0.142027 0.167364 -0.393851 0.157990 0.155179 0.147319 0.132629 0.135327 -0.084863 0.138493 0.140098 -0.576863 0.389632 -0.452646 0.355461 -0.384115 0.166583 0.148878 0.139214
chargesum: -0.00000
title: Mulliken charges with hydrogens summed into heavy atoms:
elementType: C C C C C C C C C C C C O C C O O C
charge: -0.242021 0.270957 -0.862463 0.394928 -0.046498 -0.062199 0.179907 -0.283302 0.382155 -0.012241 -0.197597 0.601250 -0.169386 0.066638 0.193728 -0.187230 -0.097185 0.070560
chargesum: 0.00000
1716.lowfreq: -11.1149 -0.0008 -0.0002 0.0002 6.0225 9.3624 87.7550 94.5478 118.9167
frequency: 87.7378 94.5436 118.9133 137.0135 153.5080 177.9433 197.7252 213.6848 218.7243 227.3463 247.3685 275.7803 290.5180 299.3709 312.9754 323.1134 330.6836 348.2130 357.1796 380.1726 389.8392 420.0177 446.6553 462.1813 474.9507 494.8121 522.3082 565.7414 590.4177 612.8826 662.1277 663.8091 708.5436 728.2660 764.7024 809.9227 846.0664 858.2422 884.8853 905.7714 908.4303 916.8831 936.1934 946.3662 964.3704 976.4149 984.8772 1001.0822 1004.6923 1011.4465 1028.1136 1041.7231 1047.7243 1055.7854 1085.3848 1102.0068 1124.1887 1130.6020 1146.0269 1165.9816 1172.8704 1185.2332 1190.2945 1205.5886 1226.5228 1227.5896 1244.5647 1261.8739 1277.0490 1281.7867 1282.9291 1300.9137 1312.1884 1327.2797 1331.0832 1335.7316 1347.5480 1368.8755 1376.7383 1394.1953 1410.0538 1412.7065 1416.7394 1429.4981 1440.9962 1448.6201 1492.2017 1495.4975 1496.9455 1500.7865 1505.1080 1515.3411 1516.4738 1540.0062 1543.0576 1731.1966 3010.2318 3024.0860 3039.3132 3039.8561 3047.2484 3052.0322 3058.7281 3066.6929 3073.6870 3080.2349 3081.5465 3089.1997 3091.8303 3098.0890 3102.2983 3111.7306 3123.5345 3137.1713 3137.2784 3164.1139 3168.7406 3803.5346 3827.0583 3832.1464
redmass: 5.3388 4.7755 3.7445 4.4599 4.0818 2.0485 1.1206 2.6902 1.4991 1.2319 2.1826 1.5551 2.1193 2.4591 2.8956 1.1822 3.2800 2.6815 2.7362 3.6375 2.8470 2.2835 2.8692 3.3838 2.5413 2.1607 4.0645 2.4327 3.9071 3.4428 3.5065 3.8181 3.6682 2.6675 2.1225 2.9981 2.3027 3.0069 2.1722 2.0624 1.9696 2.5059 2.1203 1.9993 4.3713 1.8222 1.6799 1.4671 2.9049 1.9078 2.4737 3.1591 2.3299 3.1060 2.0969 2.2892 1.9256 2.1808 1.6881 1.6064 2.1109 1.7766 2.3408 1.2563 1.2453 1.4639 1.3115 1.3436 1.4116 1.5901 1.3748 1.1868 1.3682 1.4618 1.4362 1.5567 1.3534 1.4368 1.4111 1.2063 1.3418 1.2493 1.3278 1.4319 1.3490 1.3188 1.0526 1.0608 1.0508 1.0741 1.0622 1.0818 1.0745 1.0748 1.0742 7.2294 1.0672 1.0357 1.0498 1.0569 1.0745 1.0637 1.0715 1.0833 1.0993 1.0961 1.0848 1.0993 1.1023 1.0910 1.1016 1.0951 1.0912 1.1005 1.0850 1.0968 1.0905 1.0665 1.0669 1.0670
irintensity: 1.7707 12.6760 1.8451 2.1855 7.5086 43.2990 139.7927 7.8535 97.5821 107.3889 7.9212 0.9589 4.5097 2.4166 1.0201 170.6885 9.3024 2.3081 1.4251 5.7877 1.1207 3.0753 3.1168 13.1749 1.7537 8.8705 8.3102 17.0494 3.1266 1.0370 21.0367 0.2882 3.7743 12.8404 25.4787 15.3922 33.7931 9.4795 8.0231 3.0188 7.7994 2.7855 2.8250 34.8097 211.1605 4.6412 21.6811 2.3224 33.5954 72.7239 3.5943 123.9256 11.2511 7.7059 54.4788 10.0971 24.1344 11.6159 7.7346 22.8601 1.8855 1.4858 3.4154 1.7745 93.4603 10.9207 29.1322 22.3480 1.1622 3.7118 0.6900 9.6709 0.3351 6.4312 2.1437 0.4101 2.8837 2.7247 1.3279 53.4171 4.1227 6.3908 28.6910 5.5944 12.6864 4.8355 8.9548 8.8742 4.4181 3.0186 14.0164 22.7152 2.5989 16.1098 20.0348 11.1346 71.9859 50.8671 53.4973 57.5617 48.2877 131.1121 23.3204 81.3029 103.0628 26.6077 10.3284 57.8758 58.1998 69.4754 63.8178 51.3129 24.8567 49.6818 21.5194 69.5491 31.7328 31.3133 67.1129 70.1159
temp: 298.150 k
press: 1.00000 atm
elementType: 6 6 6 6 6 6 6 1 1 1 1 6 1 6 6 6 1 6 1 1 8 1 1 1 1 6 1 1 1 1 1 6 1 1 8 1 8 1 6 1 1 1
symmnumber: 1
zpe: 980874.6 jmol-1
zpe.correction: 0.373595 hartree
zpe.thermalcorrener: 0.390903 hartree
zpe.thermalcorrenthalpy: 0.391847 hartree
zpe.thermalcorrgfe: 0.331709 hartree
zpe.sumelectzpe: -811.414581 hartree
zpe.sumelectthermal: -811.397274 hartree
zpe.sumelectthermalent: -811.396330 hartree
zpe.sumelectthermalfe: -811.456468 hartree
dipole: 3.4398 0.7981 1.4583
dipole: 3.8204
quadrupole: -112.8461 -101.6639 -117.6224
quadrupole: 4.4176 2.2553 -1.2711
quadrupole: -2.1353 9.0469 -6.9116 4.4176 2.2553 -1.2711
hfenergy: -811.7881766 hartree
pointgroup: C01 [X(C15H24O3)]
dipole: 1.3528478 0.3088909 0.5775613 debye
polarizability: 247.00517|6.108176|246.6166621|5.0099653|4.0469113|219.4728686 unknown
InChI: InChI=1/15C.3O.24H
charge 0 multiplicity 1
42 atoms
C  -0.00601035 1.1797563 1.58926996
C  -0.36176455 -0.33072001 1.43229771
C  -0.91187757 -0.68161061 0.01251741
C  -0.02393018 2.00419831 0.26370339
C  -2.22267651 0.0317123 -0.46425613
C  -1.46979277 2.39365147 0.02383799
C  -2.42470642 1.50801653 -0.26455204
H  -0.69855541 1.65939296 2.2881294
H  0.98416584 1.26403689 2.05058912
H  -1.05273475 -0.63767766 2.22133052
H  -3.03882889 -0.47574227 0.05727954
C  0.50200501 1.17832847 -0.96076437
H  -0.0621794 1.4963822 -1.84420146
C  0.38238515 -0.35924103 -0.80704208
C  1.56162387 -1.01028989 0.03339538
C  0.94159797 -1.16579969 1.46419174
H  0.73602075 -2.21667098 1.68719795
C  -1.28723954 -2.18340748 -0.06173947
H  -0.43398344 -2.83291051 0.11439836
H  -1.6743183 -2.39466238 -1.06466493
O  -2.29127979 -2.46376727 0.93517842
H  -2.59767441 -3.3709142 0.80799049
H  1.62043125 -0.81659948 2.25000671
H  0.35615612 -0.80849565 -1.80529207
H  1.53797668 1.44116156 -1.17829138
C  0.81735956 3.28066502 0.43344003
H  0.77305633 3.89840049 -0.47130396
H  0.45072913 3.88345101 1.27287694
H  1.86777221 3.03838213 0.62548355
H  -3.45005416 1.84208242 -0.41346136
H  -1.73250449 3.44510886 0.13871867
C  2.82664906 -0.14078587 0.1604948
H  2.59983359 0.82421849 0.62553861
H  3.53126671 -0.6643692 0.8221444
O  3.42967189 0.06156263 -1.12800756
H  4.21887952 0.60737477 -1.01466563
O  -2.48015282 -0.28214037 -1.86452528
H  -1.91686826 0.29002308 -2.40451171
C  2.02255723 -2.35247684 -0.57639266
H  2.52187404 -2.18266053 -1.53418011
H  2.73509428 -2.84761876 0.09432333
H  1.19739981 -3.04404721 -0.75263527
