program: Gaussian 16
title: Title
version: ES64L-G16RevC.01
frameworkgroup: C1[X(C15H24O3)]
method: RB3LYP
basis: 6-31+G(d,p)
operation: Freq
keyword: #N
keyword: Geom=AllCheck
keyword: Guess=TCheck
keyword: SCRF=Check
keyword: GenChk
keyword: RB3LYP/6-31+G(d,p)
keyword: Freq
converged: YES YES YES YES
title: Mulliken charges:
elementType: C C C C C C C H H H H C H C C C H C H H O H H H H C H H H H H C H H O H O H C H H H
charge: -0.560640 0.130969 -1.223308 0.337476 0.377733 -0.188419 -0.042022 0.149977 0.137360 0.134228 0.105988 -0.524032 0.164553 0.095878 -0.134918 -0.286752 0.149240 0.395918 0.144693 0.137051 -0.575610 0.408258 0.126260 0.143097 0.136560 -0.375599 0.148467 0.159242 0.155046 0.130551 0.133659 -0.194869 0.145922 0.140072 -0.486388 0.353219 -0.564432 0.405426 -0.350252 0.152612 0.146220 0.161565
chargesum: -0.00000
title: Mulliken charges with hydrogens summed into heavy atoms:
elementType: C C C C C C C C C C C C O C C O O C
charge: -0.273302 0.265196 -1.223308 0.337476 0.483722 -0.054760 0.088529 -0.222919 0.238975 -0.134918 -0.011252 0.677662 -0.167352 0.087156 0.091124 -0.133169 -0.159006 0.110144
chargesum: 0.00000
1716.lowfreq: 0.0003 0.0005 0.0010 5.4364 7.1747 12.0334 78.1562 87.3371 120.6915
frequency: 78.1543 87.3209 120.6876 134.6284 163.2182 201.7474 227.6948 232.6629 262.1037 277.5611 281.2683 288.4577 294.8319 297.5541 321.2252 328.9697 331.8048 359.1276 381.2333 405.2437 411.1300 433.9703 452.4872 466.9701 515.8030 520.6676 554.0685 584.5307 610.4919 630.9944 663.1752 675.2042 703.0460 736.3327 767.9242 812.7352 847.7216 871.3861 883.8376 898.3864 919.2803 929.9960 942.2467 948.9956 965.8578 978.2895 987.1344 994.1345 1000.8373 1017.3485 1028.8859 1035.9599 1041.9662 1055.4341 1080.0688 1101.4329 1120.0554 1130.1512 1136.0485 1160.5382 1172.1314 1182.3929 1191.7549 1206.2225 1239.0452 1247.4845 1260.2615 1264.3258 1279.6136 1282.0904 1296.0333 1304.0433 1327.6242 1332.0493 1333.4422 1345.8552 1368.0594 1375.4799 1384.3499 1389.5856 1408.7978 1412.7500 1426.2810 1428.4458 1442.5681 1461.8289 1490.7829 1495.6221 1496.3728 1497.8524 1499.9688 1509.0424 1521.5190 1531.8294 1544.1454 1740.0149 2961.7574 3024.4457 3032.6157 3037.9172 3039.9269 3044.1793 3048.4212 3060.7415 3073.1316 3081.9042 3091.7785 3092.1436 3093.8471 3099.8555 3102.8371 3106.9999 3109.4056 3137.6648 3144.2139 3155.5057 3165.2586 3635.4861 3812.1218 3827.3429
redmass: 5.6988 4.6820 3.8239 4.0416 3.2507 2.1303 2.7423 1.3246 2.7581 1.6145 1.1980 1.9954 2.8542 1.4911 2.6990 2.2384 3.3738 3.1648 2.5895 2.8059 2.4164 2.7247 2.9341 2.9583 3.5034 2.8693 2.1251 2.9439 1.2549 3.2937 3.7826 2.7572 4.2248 2.3862 2.3071 3.1265 2.5233 2.4202 2.4300 2.3618 2.3333 1.8933 1.8288 2.2206 1.7626 2.2238 3.0642 2.3723 1.5020 1.9518 4.3553 2.6250 2.9107 2.0842 2.4494 2.3496 1.9943 1.9246 1.8603 1.5905 2.2815 1.9688 2.2709 1.2489 1.2142 1.5073 1.3888 1.5496 1.5118 1.3721 1.1896 1.2212 1.4368 1.3703 1.5283 1.3576 1.3631 1.3655 1.2697 1.2590 1.2379 1.2997 1.2395 1.3116 1.3119 1.5818 1.0598 1.0613 1.0548 1.0568 1.0654 1.0817 1.0725 1.0757 1.0847 7.3370 1.0829 1.0356 1.0725 1.0572 1.0518 1.0634 1.0642 1.0837 1.0641 1.0998 1.0936 1.1015 1.0895 1.1062 1.1028 1.0965 1.1022 1.0849 1.0986 1.0905 1.0967 1.0661 1.0661 1.0670
irintensity: 3.4939 1.7534 2.9214 1.6746 9.6709 7.9591 4.1669 0.4909 8.2878 12.9303 122.9508 31.0896 32.6477 101.1392 13.8097 11.5457 5.0686 1.5443 14.2542 5.0281 0.8948 1.7151 11.5562 4.0824 8.2050 11.0536 3.5912 29.7900 168.3190 29.7627 0.4940 51.6141 1.3568 12.4224 15.3895 4.3080 8.7644 6.7517 15.1147 3.5472 3.3473 0.4923 32.5360 17.1532 21.3050 47.2166 7.1945 81.1648 10.4983 38.0032 167.8159 26.4535 42.8719 8.4348 103.4685 4.8904 2.6699 5.1625 4.3568 16.2633 6.1259 5.3773 1.6655 21.9551 26.1730 8.6124 24.4397 10.8092 10.1842 3.9363 74.9998 54.5825 3.5195 4.5013 1.4454 1.2382 10.5527 8.7711 9.1964 16.9909 41.7716 5.3522 10.3072 4.0261 1.6647 65.7540 1.2474 10.1076 1.5129 3.5668 25.3391 8.5363 1.2298 21.0260 18.2848 10.5681 89.9161 50.2786 89.3338 17.0639 66.8106 92.7892 56.9489 118.5117 51.6632 66.2793 46.3160 81.6014 31.2572 72.0100 25.1247 66.3346 63.9794 21.1985 52.9630 36.3082 60.9727 375.7618 38.4145 83.1976
temp: 298.150 k
press: 1.00000 atm
elementType: 6 6 6 6 6 6 6 1 1 1 1 6 1 6 6 6 1 6 1 1 8 1 1 1 1 6 1 1 1 1 1 6 1 1 8 1 8 1 6 1 1 1
symmnumber: 1
zpe: 983092.2 jmol-1
zpe.correction: 0.374440 hartree
zpe.thermalcorrener: 0.391212 hartree
zpe.thermalcorrenthalpy: 0.392156 hartree
zpe.thermalcorrgfe: 0.333062 hartree
zpe.sumelectzpe: -811.415174 hartree
zpe.sumelectthermal: -811.398402 hartree
zpe.sumelectthermalent: -811.397458 hartree
zpe.sumelectthermalfe: -811.456552 hartree
dipole: 0.3848 -1.4721 4.9014
dipole: 5.1322
quadrupole: -132.9044 -97.3370 -112.3253
quadrupole: -0.7139 -0.8736 -5.2093
quadrupole: -18.7155 16.8519 1.8636 -0.7139 -0.8736 -5.2093
hfenergy: -811.7896137 hartree
pointgroup: C01 [X(C15H24O3)]
dipole: 0.1687904 -0.568882 1.9299978 debye
polarizability: 245.0706853|3.9164492|251.6237384|0.21099|-1.4522547|215.731476 unknown
InChI: InChI=1/15C.3O.24H
charge 0 multiplicity 1
42 atoms
C  -0.25332892 1.55428232 1.3106266
C  -0.03525687 0.02586728 1.54087848
C  -0.65260372 -0.85555102 0.40268887
C  -0.81644964 1.93731278 -0.09200086
C  -2.2005584 -0.75629339 0.14342209
C  -2.32012957 1.76236819 -0.00460085
C  -2.90471644 0.57235886 0.12595559
H  -0.93461916 1.95710689 2.0664096
H  0.70025389 2.07082256 1.46578323
H  -0.40658641 -0.26021316 2.53113538
H  -2.67171631 -1.33233809 0.95639454
C  -0.25360449 1.02116687 -1.23396789
H  -1.05586163 0.85683377 -1.95791549
C  0.2563023 -0.3652283 -0.76766409
C  1.71783233 -0.3707413 -0.15939997
C  1.47795341 -0.27975304 1.38721308
H  1.7647572 -1.20727893 1.88916345
C  -0.43245239 -2.34452106 0.78399785
H  -1.1204611 -2.59715286 1.60085039
H  0.57671255 -2.54446107 1.13710174
O  -0.69742226 -3.19006356 -0.35801221
H  -0.74007724 -4.11001951 -0.06443772
H  2.07531279 0.50667075 1.86218677
H  0.21843043 -1.04623642 -1.62142255
H  0.52962465 1.5508399 -1.78152216
C  -0.49697992 3.41123513 -0.39282062
H  0.58404822 3.57743598 -0.4460248
H  -0.9338596 3.71547203 -1.3512228
H  -0.90179882 4.06749928 0.38682309
H  -3.98849443 0.50184002 0.19878687
H  -2.93184623 2.66435092 -0.00203391
C  2.57325004 0.82381705 -0.63915005
H  2.63416465 0.82862237 -1.73199441
H  2.13641382 1.77590352 -0.31973516
O  3.9373444 0.75834645 -0.1943758
H  3.95395951 0.81081558 0.77126107
O  -2.5513118 -1.3907013 -1.11121074
H  -2.10217681 -2.25664277 -1.11376502
C  2.46629622 -1.65588025 -0.57463483
H  1.86585569 -2.55276652 -0.41554276
H  2.71661529 -1.61797602 -1.64159393
H  3.40076078 -1.75958294 -0.0161741
