program: Gaussian 16
title: Title
version: ES64L-G16RevC.01
frameworkgroup: C1[X(C15H24O3)]
method: RB3LYP
basis: 6-31+G(d,p)
operation: Freq
keyword: #N
keyword: Geom=AllCheck
keyword: Guess=TCheck
keyword: SCRF=Check
keyword: GenChk
keyword: RB3LYP/6-31+G(d,p)
keyword: Freq
converged: YES YES YES YES
title: Mulliken charges:
elementType: C C C C C C C H H H H C H C C C H C H H O H H H H C H H H H H C H H O H O H C H H H
charge: -0.529553 0.251512 -1.074741 0.386859 0.036504 -0.166669 0.040054 0.150389 0.137145 0.126555 0.152567 -0.591200 0.137522 0.188488 -0.024243 -0.487578 0.152638 0.164758 0.125318 0.163981 -0.494167 0.364551 0.140636 0.143053 0.167878 -0.396777 0.158622 0.155514 0.147667 0.133347 0.135920 -0.057857 0.138651 0.140632 -0.576506 0.390229 -0.453980 0.355104 -0.389292 0.167566 0.149433 0.139472
chargesum: 0.00000
title: Mulliken charges with hydrogens summed into heavy atoms:
elementType: C C C C C C C C C C C C O C C O O C
charge: -0.242019 0.378067 -1.074741 0.386859 0.189071 -0.030749 0.173401 -0.285800 0.331541 -0.024243 -0.194304 0.454057 -0.129616 0.065026 0.221425 -0.186277 -0.098876 0.067179
chargesum: -0.00000
1716.lowfreq: -9.4282 0.0007 0.0009 0.0010 7.9341 11.2596 89.8173 100.7013 119.2990
frequency: 89.8080 100.6914 119.2938 137.1919 152.2049 179.2630 212.3041 219.0412 227.3068 247.0961 275.4035 281.8894 291.1919 299.8632 313.1725 321.8398 330.5205 347.9242 357.6660 379.5763 389.8545 419.1872 444.7235 463.2566 474.8405 496.2743 523.0660 567.1753 591.7154 615.0329 662.6286 668.9577 710.7657 729.1243 764.3036 809.9232 840.8600 858.5443 884.7699 901.4154 907.5009 913.8534 936.1942 947.7221 962.1149 975.3408 984.5836 999.8599 1003.8495 1012.1045 1030.7229 1036.1205 1045.1374 1054.3008 1082.3463 1092.9133 1114.0315 1128.8286 1149.6669 1155.0612 1178.2555 1186.0869 1189.1928 1211.2429 1218.7070 1231.7840 1249.4145 1257.7600 1279.4739 1283.1893 1288.6934 1307.0666 1326.2246 1332.7029 1334.2758 1353.8925 1368.4418 1376.4289 1385.8045 1393.9527 1403.1745 1410.8822 1417.7225 1420.1850 1431.6150 1449.1317 1492.1368 1495.5057 1496.9910 1500.1036 1504.8833 1511.2414 1515.7981 1538.1810 1540.1941 1731.1232 3010.4874 3024.6579 3040.1813 3041.7316 3048.4069 3049.8232 3063.5650 3067.7093 3075.1676 3077.0659 3082.2496 3089.2852 3092.5759 3102.7531 3107.0460 3113.3478 3123.1725 3137.8685 3139.3562 3164.5086 3179.6298 3804.0546 3822.5234 3827.3513
redmass: 4.9260 4.0736 3.6576 4.5998 3.8081 2.1589 3.2724 1.4641 1.2366 2.1896 1.5005 1.3430 1.7192 2.6779 2.7085 1.2151 3.0360 2.5559 2.5833 3.6064 2.8037 2.2625 2.8820 3.3208 2.5424 2.1956 3.9661 2.4939 3.8728 3.4995 3.9002 3.6443 3.6900 2.7014 2.1186 3.0208 2.2106 2.8509 2.0977 2.0320 2.0657 2.3316 2.1410 2.0068 3.8692 1.8522 1.7530 1.7528 2.0627 1.9123 2.4503 2.4832 3.3257 2.9322 2.0741 2.2757 1.9728 1.9674 1.8147 1.7240 2.3506 1.8976 2.0317 1.3295 1.3281 1.3267 1.3499 1.4532 1.3848 1.5694 1.4270 1.3578 1.4391 1.3941 1.5443 1.3569 1.4295 1.3497 1.2435 1.2180 1.2253 1.3315 1.2988 1.2271 1.4756 1.3216 1.0536 1.0622 1.0507 1.0705 1.0636 1.0727 1.0784 1.0749 1.0750 7.2220 1.0672 1.0356 1.0441 1.0631 1.0745 1.0667 1.0833 1.0841 1.0847 1.0941 1.1015 1.1017 1.1024 1.1018 1.0673 1.0936 1.0914 1.0849 1.1011 1.0968 1.0981 1.0665 1.0667 1.0669
irintensity: 1.7052 1.6866 4.1613 4.6710 4.1214 18.2820 1.3089 104.7765 84.6655 7.9803 30.8882 118.2517 41.1611 2.0654 8.7370 176.0625 5.2967 17.3550 15.0122 1.2949 0.9735 5.7726 4.0195 5.1960 4.0761 3.6771 2.3608 12.1098 3.2676 1.8856 6.8470 3.2004 5.4155 8.3206 22.5682 18.0622 49.4752 4.7104 11.4374 2.0707 4.4386 5.8679 4.1447 36.3548 190.6307 31.2955 15.8363 13.3371 50.0826 86.4511 1.3436 80.0936 70.0670 18.5289 28.2467 12.5278 26.7168 16.5936 5.5422 9.2770 1.2954 11.0482 6.9638 57.1272 11.4723 45.4867 3.5645 2.4710 6.3561 6.1643 3.9872 10.7847 5.4693 2.6553 0.7203 2.2936 0.8608 5.1469 25.7724 52.0702 24.0042 3.1785 33.1413 2.9855 13.8019 6.0195 9.0351 7.3739 5.2150 1.6958 19.5245 4.5858 17.9215 18.8513 15.4888 10.9260 72.4181 51.2028 54.6934 56.1114 42.8621 57.2739 167.9733 28.5827 12.4408 131.3227 7.9983 76.8207 52.2272 61.3275 33.6545 57.4062 25.8122 18.6044 47.1667 66.2832 28.1967 32.6243 44.1308 67.3026
temp: 298.150 k
press: 1.00000 atm
elementType: 6 6 6 6 6 6 6 1 1 1 1 6 1 6 6 6 1 6 1 1 8 1 1 1 1 6 1 1 1 1 1 6 1 1 8 1 8 1 6 1 1 1
symmnumber: 1
zpe: 981702.8 jmol-1
zpe.correction: 0.373911 hartree
zpe.thermalcorrener: 0.391081 hartree
zpe.thermalcorrenthalpy: 0.392025 hartree
zpe.thermalcorrgfe: 0.332264 hartree
zpe.sumelectzpe: -811.415047 hartree
zpe.sumelectthermal: -811.397877 hartree
zpe.sumelectthermalent: -811.396933 hartree
zpe.sumelectthermalfe: -811.456694 hartree
dipole: 4.8934 2.7121 3.3372
dipole: 6.5145
quadrupole: -118.8306 -112.4644 -111.5862
quadrupole: -4.1917 -0.2842 -4.8462
quadrupole: -4.5369 1.8294 2.7075 -4.1917 -0.2842 -4.8462
hfenergy: -811.788958 hartree
pointgroup: C01 [X(C15H24O3)]
dipole: 1.930312 1.0528239 1.3169486 debye
polarizability: 246.6552061|5.7805517|245.8960365|4.723263|3.6911858|220.0038486 unknown
InChI: InChI=1/15C.3O.24H
charge 0 multiplicity 1
42 atoms
C  -0.00442935 1.18172845 1.58718177
C  -0.35674077 -0.33010443 1.43058703
C  -0.90838808 -0.68395964 0.01309764
C  -0.02913373 2.00503144 0.26146709
C  -2.22201091 0.02290634 -0.45833294
C  -1.47736743 2.38813597 0.02429978
C  -2.42985057 1.49853771 -0.26009684
H  -0.69599453 1.65891121 2.28837706
H  0.98683252 1.26730591 2.04550834
H  -1.04419596 -0.62398096 2.23066044
H  -3.03336525 -0.48806338 0.06843018
C  0.49888055 1.18064989 -0.96296873
H  -0.06730508 1.49576444 -1.84606859
C  0.38397935 -0.35713925 -0.80739443
C  1.56620321 -1.00441658 0.03206591
C  0.9488773 -1.16235519 1.46347
H  0.75164535 -2.21545018 1.68604927
C  -1.28370621 -2.19410177 -0.06557885
H  -0.43144181 -2.84607807 0.10471964
H  -1.66685103 -2.40251939 -1.06612021
O  -2.33746163 -2.56226631 0.84278743
H  -1.97364822 -2.61517883 1.736557
H  1.62596466 -0.81153254 2.24972443
H  0.35771282 -0.80785026 -1.80494604
H  1.53379756 1.44708276 -1.18142934
C  0.80692464 3.28512331 0.42981797
H  0.75829361 3.90217807 -0.47508922
H  0.43899365 3.88658104 1.2696006
H  1.85870469 3.0475011 0.62008115
H  -3.45673741 1.82859062 -0.40721067
H  -1.74365399 3.43883203 0.13747685
C  2.82895604 -0.13107649 0.15745573
H  2.59995061 0.83385167 0.62158095
H  3.53555697 -0.65201407 0.81905777
O  3.42915069 0.07099077 -1.13194753
H  4.21642527 0.62007815 -1.0210428
O  -2.48304107 -0.29428277 -1.85698006
H  -1.92806613 0.28306984 -2.40000478
C  2.03032113 -2.34572004 -0.57707877
H  2.52498295 -2.17491247 -1.53697789
H  2.7476692 -2.83654656 0.09157664
H  1.20788439 -3.04135651 -0.74947594
