program: Gaussian 09
title: 000070019
version: EM64L-G09RevD.01
frameworkgroup: C1[X(C10H12O4)]
method: RPBEPBE
basis: SDD
operation: Freq
keyword: #pfreq=noraman
keyword: PBEPBE/SDD
title: #p freq=noraman PBEPBE/SDD
converged: YES YES NO NO
title: Mulliken charges:
elementType: O O O O C C C C C C C C C C H H H H H H H H H H H H
charge: -0.274865 -0.284407 -0.262802 -0.251060 0.102091 0.262300 0.291059 0.378071 -0.526854 -0.539998 -0.204166 -0.527876 -0.532287 -0.534560 0.271866 0.270376 0.220407 0.226071 0.295378 0.211253 0.228712 0.226857 0.248600 0.226784 0.247349 0.231702
chargesum: 0.00000
title: Mulliken charges with hydrogens summed into heavy atoms:
elementType: O O O O C C C C C C C C C C
charge: -0.274865 -0.284407 -0.262802 -0.251060 0.102091 0.262300 0.291059 0.378071 -0.254988 -0.269622 0.016241 0.204826 0.171882 0.171274
polarizability: 1.78419782e+02 -1.03766487e-01 1.51999182e+02 2.50634764e+00 5.17928091e-01 6.74013915e+01
1716.lowfreq: -7.4833 -4.7540 -0.0006 -0.0004 -0.0002 8.8245 54.5357 80.9120 96.3168
frequency: 54.5139 80.9092 96.3111 112.0481 129.5977 161.7376 179.0662 186.9388 203.4911 212.7563 235.4041 263.7239 270.7095 299.3049 329.2308 362.7592 391.9716 432.1701 486.9607 512.2326 565.5268 614.0461 634.4661 668.4362 737.1503 780.6155 823.1616 851.8939 877.7663 889.0534 979.1011 981.9483 1033.7506 1075.4818 1112.9824 1113.5977 1115.3677 1135.4139 1153.0859 1161.6407 1166.7474 1195.1438 1224.0107 1293.7162 1361.5051 1406.3804 1414.8427 1422.9265 1440.8604 1444.6671 1451.3114 1460.3477 1467.3398 1468.1374 1474.4148 1478.3617 1484.9356 1555.4121 1590.3921 1613.0143 2968.9525 2971.6177 2976.2430 2981.6611 3061.1242 3064.2883 3092.2541 3126.0314 3130.6161 3132.5341 3187.0692 3192.4860
redmass: 4.9527 3.0168 2.5699 3.6987 1.6063 3.6654 2.8673 2.4550 1.8492 2.0316 2.1100 2.7317 1.7471 3.1348 4.4110 5.3648 4.7261 5.3011 5.8900 6.4670 5.9524 4.2668 3.5028 4.3483 2.7354 5.0407 1.5365 2.0070 7.7970 7.5097 3.6313 2.5509 3.1631 5.3878 1.2583 1.2576 1.2441 1.8193 1.3780 1.4263 1.8085 2.5365 1.9322 5.1660 2.6630 1.7196 2.1168 1.4386 1.2206 1.4088 1.2300 1.7317 1.0535 1.0601 1.0933 1.2280 1.0808 7.3958 5.3325 6.8015 1.0325 1.0323 1.0807 1.0354 1.1044 1.1043 1.1011 1.1054 1.1004 1.1006 1.0912 1.0914
irintensity: 1.3469 9.5027 5.9301 1.0013 0.4918 4.4754 3.9241 10.9617 3.9969 4.0703 0.8376 4.9168 0.2375 4.9209 1.4772 5.3415 15.6346 4.7362 6.3343 22.7633 29.7311 2.5949 5.4034 0.1331 7.1138 15.7955 6.9420 68.2926 5.3886 4.2871 0.5742 3.6868 49.7568 192.1508 0.4716 0.2278 9.2337 129.2362 6.0052 34.1048 116.1748 165.7320 63.9112 58.4540 67.6222 37.9122 87.7571 16.1209 42.5567 50.7064 20.7332 39.0498 14.0716 15.7991 29.1568 26.9412 41.3408 169.8508 400.9591 399.0099 63.7983 60.3481 47.0437 61.1863 38.3011 41.6230 31.3810 9.1316 18.4407 21.2290 1.8659 1.2474
temp: 298.150 k
press: 1.00000 atm
elementType: 8 8 8 8 6 6 6 6 6 6 6 6 6 6 1 1 1 1 1 1 1 1 1 1 1 1
symmnumber: 1
zpe: 529979.6 jmol-1
zpe.correction: 0.201859 hartree
zpe.thermalcorrener: 0.216409 hartree
zpe.thermalcorrenthalpy: 0.217354 hartree
zpe.thermalcorrgfe: 0.160736 hartree
zpe.sumelectzpe: -688.044168 hartree
zpe.sumelectthermal: -688.029618 hartree
zpe.sumelectthermalent: -688.028673 hartree
zpe.sumelectthermalfe: -688.085291 hartree
dipole: 4.5423 0.8651 1.9415
dipole: 5.0150
quadrupole: -85.2802 -64.7507 -84.2811
quadrupole: -3.4349 -6.8645 -2.3989
quadrupole: -7.1762 13.3533 -6.1771 -3.4349 -6.8645 -2.3989
hfenergy: -688.246027 hartree
pointgroup: C01 [X(C10H12O4)]
dipole: -1.8290569 0.3976719 -0.6239731 debye
dipolederiv: -0.8184972 0.6505328 0.1977794 0.5454469 -1.0489841 -0.2253641 0.0706424 0.0027563 -0.3462046 -0.3270675 -0.2711284 0.0357827 -0.0230708 -1.6572171 0.1248628 0.0195532 0.1484454 -0.3009275 -1.783978 -0.4522097 0.1768582 -0.3369338 -0.4785452 0.0429859 0.1692188 0.0777569 -0.3153118 -1.2394329 0.0712699 -0.1027573 0.5056277 -0.4651382 0.0529414 -0.2378923 -0.0103141 -0.398556 -1.1744423 -0.1287783 -0.0621338 -0.2916423 -0.66756 -0.013834 0.0033415 0.0705194 -0.111154 1.0335087 -0.4152891 -0.0961162 -0.1575691 1.1445906 0.2164502 -0.0629724 -0.0230485 0.1103163 0.7625149 0.6400388 -0.0807666 -0.1073056 1.2915148 -0.1500241 -0.0075066 -0.1682252 0.1307595 1.7473104 0.2929999 -0.180628 -0.1123016 0.7320032 -0.0048514 -0.1769334 -0.0809062 0.1585088 -0.9301377 0.3054988 0.0898243 0.3690118 -0.3151352 -0.0533949 0.0686799 -0.0836857 -0.278334 -0.6506618 -0.519464 0.0528901 -0.3088192 -0.49418 0.0135714 0.0599237 0.0702367 -0.2608314 1.7971774 0.0670901 0.1951867 -0.0557362 0.5364858 -0.1167759 0.2362106 -0.0878914 0.1554185 0.508147 -0.3917989 -0.2033056 -0.1006039 0.2895698 0.0469078 -0.1933356 0.1708797 0.366765 0.2529814 -0.3474563 0.0320673 -0.0630548 0.7989005 -0.0347413 0.0108085 -0.0148034 0.3156959 0.5542461 0.1697718 -0.0372764 0.5644331 0.4878033 -0.0663102 -0.0849761 -0.0348909 0.3222627 0.0723039 -0.0514811 0.0048862 -0.0712101 -0.0119842 0.0099687 0.0324772 -0.0175727 0.1782818 0.0602455 0.0771528 0.0017833 0.0732381 0.0109409 0.0117016 0.0066955 0.0194891 0.183851 0.0673163 -0.0342898 -0.00046 -0.1057017 -0.1383505 0.0341568 -0.0034039 0.0572567 0.1113851 0.0834553 -0.0084828 0.024359 0.0688023 -0.1748295 -0.0651089 0.0625451 -0.08104 0.0832427 -0.021905 0.0374424 0.0039477 -0.1170075 0.1945911 0.0165271 -0.0405671 0.0088249 0.0769867 0.0068657 0.0783925 -0.0232474 0.0123392 0.0336868 0.1339219 0.0509535 -0.0015956 -0.1228855 0.0136051 0.1513926 0.0911546 0.0024818 0.0148478 0.0295482 0.0885267 -0.0502678 -0.0934632 -0.022985 0.1429813 -0.1283549 -0.0162464 0.0147323 -0.0365127 -0.102438 0.0148277 -0.0591148 0.0197441 -0.1300533 0.0177812 -0.0648664 -0.0809441 0.0208787 0.0118217 0.0251999 0.1220015 0.0811018 0.0341583 0.0619033 -0.134892 -0.0664123 -0.0728392 0.0097092 -0.1053721 -0.0743229 -0.1555821 -0.0111674 0.0331118 0.0389457 0.0795264 -0.0016171 0.0298804 0.0047456 0.1211127 0.0641658 0.0428768 -0.1042696 -0.1133654 -0.029913 0.0869513 -0.0209627 0.0886752 -0.0754826 unknown
polarizability: 178.0682235|-1.0152581|151.9957091|-6.4594326|-1.733277|67.7564234 unknown
InChI: InChI=1S/C10H12O4/c1-12-7-4-9(13-2)8(6-11)10(5-7)14-3/h4-6H,1-3H3
charge 0 multiplicity 1
26 atoms
O  1.000828 -2.413649 -0.10333
O  0.652099 2.486024 -0.364646
O  -3.280459 -0.24657 0.214324
O  3.299262 -0.396704 0.353835
C  0.947195 0.108964 -0.142615
C  0.339233 -1.191893 -0.063814
C  0.038799 1.237681 -0.205521
C  -1.891653 -0.206386 0.086073
C  -1.063017 -1.34342 0.081172
C  -1.350335 1.094379 -0.085915
C  2.379811 0.413737 0.01698
C  2.17553 -2.630053 -0.974249
C  -0.196891 3.68096 -0.364735
C  -3.910915 -1.55873 0.406987
H  -1.451937 -2.361791 0.142186
H  -2.0390 1.940531 -0.111398
H  2.623712 1.486529 -0.131169
H  2.194371 -3.718154 -1.141413
H  3.086794 -2.273824 -0.470214
H  2.044772 -2.097089 -1.934888
H  -0.749679 3.778034 0.588922
H  -0.909327 3.664195 -1.211371
H  0.500278 4.523301 -0.480774
H  -3.745193 -2.211981 -0.470544
H  -4.983895 -1.346004 0.517273
H  -3.527684 -2.053489 1.319145
