program: Gaussian 16
title: Title
version: ES64L-G16RevC.01
frameworkgroup: C1[X(C15H24O3)]
method: RB3LYP
basis: 6-31+G(d,p)
operation: Freq
keyword: #N
keyword: Geom=AllCheck
keyword: Guess=TCheck
keyword: SCRF=Check
keyword: GenChk
keyword: RB3LYP/6-31+G(d,p)
keyword: Freq
converged: YES YES YES YES
title: Mulliken charges:
elementType: C C C C C C C H H H H C H C C C H C H H O H H H H C H H H H H C H H O H O H C H H H
charge: -0.539628 0.269541 -1.059848 0.398346 -0.090031 -0.202891 0.105949 0.152007 0.139771 0.129366 0.153817 -0.476276 0.142686 -0.033105 0.016152 -0.310897 0.154433 0.136799 0.126487 0.165056 -0.493734 0.365129 0.124937 0.146179 0.141947 -0.383355 0.148995 0.160549 0.157373 0.134655 0.136997 -0.185128 0.147571 0.139721 -0.487913 0.352931 -0.453040 0.354890 -0.343332 0.140459 0.149221 0.167216
chargesum: -0.00000
title: Mulliken charges with hydrogens summed into heavy atoms:
elementType: C C C C C C C C C C C C O C C O O C
charge: -0.247850 0.398907 -1.059848 0.398346 0.063786 -0.065894 0.240604 -0.191642 0.113073 0.016152 -0.031527 0.428342 -0.128605 0.083561 0.102164 -0.134982 -0.098150 0.113564
chargesum: 0.00000
1716.lowfreq: -9.1531 0.0002 0.0004 0.0007 3.8602 7.3664 80.5597 95.7162 110.5758
frequency: 80.5421 95.7068 110.5693 137.6957 149.6513 190.7081 206.2903 217.3566 237.1144 267.5531 272.8463 278.5507 282.2415 301.7951 311.3344 321.6844 323.3045 336.6338 356.2011 378.9711 399.0143 418.5063 426.2948 446.0998 470.8433 515.3013 523.2398 569.6936 586.6066 626.2581 651.4761 675.1938 702.6772 738.9683 765.2854 806.4021 839.4527 850.4123 879.4790 899.4997 911.6686 927.3145 937.2424 945.4540 962.7099 964.1001 982.2973 998.5850 1003.5099 1013.0266 1028.8972 1031.6665 1037.2395 1053.5628 1082.7365 1093.6413 1112.0320 1129.2628 1136.5543 1152.9938 1174.6784 1180.0324 1185.7927 1214.3563 1218.0136 1234.2062 1249.3930 1261.7945 1272.1512 1280.2234 1292.1158 1324.5003 1328.7234 1332.6147 1352.3492 1367.0621 1374.5381 1385.4373 1388.8155 1393.5389 1402.6578 1410.4940 1412.4217 1419.5639 1427.0870 1432.6060 1489.5564 1495.3870 1497.4257 1498.6034 1502.2041 1504.6958 1515.5466 1527.4385 1536.6905 1730.9284 3026.5868 3040.8699 3042.6307 3046.7218 3051.7084 3056.9029 3063.7063 3067.7593 3075.0484 3081.6696 3088.0188 3094.6160 3102.3132 3105.4733 3107.3750 3109.9925 3111.7593 3139.9600 3141.1403 3166.1039 3177.7003 3805.1598 3810.0200 3822.6620
redmass: 4.4073 4.6730 3.7642 3.8426 3.1981 1.7365 3.6367 1.3941 2.8162 1.9924 1.4180 1.2236 1.3518 2.0211 1.5636 3.0048 2.7139 2.7084 2.6905 3.1198 3.1418 2.1762 2.4051 3.0079 2.6161 2.6890 3.0900 3.3206 2.8430 3.5162 3.6383 3.6499 4.2162 2.4739 2.3228 2.8436 2.1872 2.7607 2.4287 1.9321 2.4180 1.8423 2.0112 2.1313 4.0496 1.6463 1.7542 2.1297 1.8113 1.9378 3.8758 2.6462 2.4181 2.6613 2.1127 2.2501 1.9384 1.8402 2.0093 1.6133 2.2133 2.0513 1.8991 1.3547 1.4329 1.3352 1.3239 1.5263 1.7172 1.4149 1.6951 1.4281 1.4094 1.5635 1.3460 1.3773 1.3563 1.2443 1.1985 1.2143 1.2324 1.2836 1.2627 1.3312 1.2242 1.4305 1.0566 1.0708 1.0554 1.0543 1.0624 1.0718 1.0781 1.0728 1.0756 7.2249 1.0356 1.0506 1.0576 1.0646 1.0747 1.0604 1.0834 1.0811 1.0846 1.1002 1.0995 1.1022 1.0965 1.0995 1.0713 1.0995 1.0971 1.0849 1.1013 1.0968 1.0986 1.0665 1.0663 1.0667
irintensity: 4.5239 1.5154 5.2318 4.4011 2.0206 10.6544 4.7713 3.5539 4.2663 33.8964 100.1649 124.2407 108.8610 23.4090 118.5624 23.7729 27.5078 12.3716 19.8185 4.1347 1.0559 2.3459 12.5340 3.1338 0.7089 3.3679 0.4335 1.6115 12.2477 0.4226 6.6069 0.4190 1.3354 14.5147 17.9635 18.1771 39.3740 9.3414 12.3289 7.6642 7.2148 5.1723 0.2177 40.1340 182.0546 19.5320 35.4894 63.4782 39.0298 17.9360 130.0693 42.1767 66.4088 46.8956 17.4227 14.1388 10.5795 3.9352 0.5786 35.5942 2.6286 4.2590 13.5348 12.5360 29.1035 8.2903 9.5008 11.8142 6.2498 5.1439 9.1472 4.9020 2.6493 3.2326 1.6173 6.0156 3.9071 25.6251 41.8972 40.1841 18.2501 15.3284 7.3936 39.0815 14.2648 5.3419 3.6800 7.0554 4.9176 6.6331 26.5092 4.3295 14.2465 5.5262 19.6281 10.4398 47.9393 23.6994 54.7322 102.4596 28.8190 70.6840 155.2145 20.7016 16.2187 45.9544 91.3827 44.5076 27.4119 95.2882 49.8867 52.6664 47.3461 16.8410 55.8855 63.8514 25.1304 31.2834 38.7882 43.8545
temp: 298.150 k
press: 1.00000 atm
elementType: 6 6 6 6 6 6 6 1 1 1 1 6 1 6 6 6 1 6 1 1 8 1 1 1 1 6 1 1 1 1 1 6 1 1 8 1 8 1 6 1 1 1
symmnumber: 1
zpe: 981544.9 jmol-1
zpe.correction: 0.373851 hartree
zpe.thermalcorrener: 0.391077 hartree
zpe.thermalcorrenthalpy: 0.392021 hartree
zpe.thermalcorrgfe: 0.332016 hartree
zpe.sumelectzpe: -811.413955 hartree
zpe.sumelectthermal: -811.396728 hartree
zpe.sumelectthermalent: -811.395784 hartree
zpe.sumelectthermalfe: -811.455790 hartree
dipole: 1.6590 2.9143 2.0295
dipole: 3.9197
quadrupole: -135.5850 -117.0683 -105.0356
quadrupole: -11.9349 3.2968 -3.4414
quadrupole: -16.3554 2.1613 14.1940 -11.9349 3.2968 -3.4414
hfenergy: -811.7878054 hartree
pointgroup: C01 [X(C15H24O3)]
dipole: 0.6474399 1.1491196 0.7991038 debye
polarizability: 246.0186386|4.952969|247.5943313|1.7973185|3.3179784|217.5521768 unknown
InChI: InChI=1/15C.3O.24H
charge 0 multiplicity 1
42 atoms
C  -0.08641776 1.24945554 1.44562613
C  -0.09625156 -0.30933791 1.35862558
C  -0.75613539 -0.84073697 0.04751487
C  -0.51880304 1.98817053 0.13993054
C  -2.25787199 -0.4839868 -0.20754924
C  -2.03564772 2.00753436 0.14446057
C  -2.77967599 0.90713094 0.02188529
H  -0.74758658 1.58479401 2.25040247
H  0.91749254 1.58153212 1.73154547
H  -0.56769046 -0.71805039 2.25832349
H  -2.82902423 -1.15138092 0.44455087
C  -0.01436861 1.25824073 -1.15371903
H  -0.77893056 1.37945009 -1.92800633
C  0.28008088 -0.25195593 -0.96575854
C  1.69755221 -0.56235347 -0.31740079
C  1.35644464 -0.81733527 1.19054248
H  1.44535878 -1.87889459 1.43997175
C  -0.76481468 -2.39890739 0.03050808
H  0.23515012 -2.82343801 0.05341927
H  -1.24451964 -2.73073858 -0.89198754
O  -1.53623304 -2.96898252 1.10246766
H  -1.02829702 -2.90026357 1.92177857
H  2.03336948 -0.2953496 1.87630909
H  0.21867377 -0.74103386 -1.94381865
H  0.86349016 1.77044057 -1.55375119
C  0.00108079 3.43549268 0.16524761
H  1.0954734 3.46316005 0.17842648
H  -0.34064659 3.98596316 -0.71905297
H  -0.36070005 3.9653375 1.05423755
H  -3.86554061 0.97874345 0.04690458
H  -2.52395585 2.96911751 0.30024114
C  2.69549051 0.61526676 -0.4482266
H  2.84879669 0.86086336 -1.5035126
H  2.32577328 1.51180958 0.05739675
O  4.00496229 0.30261273 0.05008411
H  3.94744522 0.14304653 1.00222325
O  -2.65075246 -0.9091079 -1.54494097
H  -2.35337415 -0.23337444 -2.17021955
C  2.36984371 -1.77084907 -1.0039562
H  1.71056471 -2.63696931 -1.07566506
H  2.66974771 -1.50547719 -2.02464226
H  3.26879208 -2.07245751 -0.45973213
