program: Gaussian 16
title: Title
version: ES64L-G16RevC.01
frameworkgroup: C1[X(C15H24O3)]
method: RB3LYP
basis: 6-31+G(d,p)
operation: Freq
keyword: #N
keyword: Geom=AllCheck
keyword: Guess=TCheck
keyword: SCRF=Check
keyword: GenChk
keyword: RB3LYP/6-31+G(d,p)
keyword: Freq
converged: YES YES YES YES
title: Mulliken charges:
elementType: C C C C C C C H H H H C H C C C H C H H O H H H H C H H H H H C H H O H O H C H H H
charge: -0.523773 0.256398 -0.997151 0.382456 0.018058 -0.167400 0.052239 0.152107 0.139185 0.128571 0.154648 -0.360568 0.149195 -0.081333 0.133345 -0.538128 0.153847 0.133634 0.126333 0.164766 -0.494632 0.365369 0.141529 0.151865 0.102738 -0.434140 0.157978 0.149131 0.160475 0.135129 0.137914 -0.239416 0.136051 0.147532 -0.497534 0.351841 -0.452466 0.355008 -0.309966 0.140218 0.166596 0.152348
chargesum: 0.00000
title: Mulliken charges with hydrogens summed into heavy atoms:
elementType: C C C C C C C C C C C C O C C O O C
charge: -0.232481 0.384969 -0.997151 0.382456 0.172706 -0.029486 0.187369 -0.108635 0.070532 0.133345 -0.242751 0.424733 -0.129262 0.033444 0.044167 -0.145693 -0.097458 0.149197
chargesum: -0.00000
1716.lowfreq: -7.4211 0.0001 0.0006 0.0007 6.7605 10.5356 86.8104 101.0046 120.1395
frequency: 86.7784 100.9980 120.1288 137.5813 150.9585 180.3216 210.4823 218.6570 243.4160 260.2454 278.6363 286.7082 297.0702 300.2961 309.3520 316.2344 330.6166 349.4678 357.7383 378.4885 388.7002 419.5886 445.5190 462.4897 471.1926 496.4612 523.5119 564.1871 591.6761 618.1944 666.8972 668.6679 713.3442 725.6413 764.3819 810.8186 840.8557 857.4158 886.3705 893.5746 904.1889 913.7668 936.1910 948.3306 962.7881 964.2559 980.1640 999.8415 1003.3640 1012.8576 1029.8857 1034.7715 1040.0179 1053.9708 1080.2320 1092.4483 1114.5023 1126.5455 1135.3005 1157.5463 1168.4485 1180.9022 1186.3324 1212.9029 1226.3493 1239.3339 1253.1727 1256.4440 1273.6592 1281.2918 1294.7404 1325.9890 1328.0600 1334.5833 1352.6929 1365.2934 1376.8494 1378.3571 1387.4820 1392.1377 1402.5601 1411.1014 1414.1203 1419.1781 1430.0105 1433.3184 1491.6906 1496.0367 1497.7360 1499.3094 1503.4411 1503.7390 1511.1072 1529.0713 1538.7229 1732.0093 3026.5959 3041.0206 3043.4888 3049.0662 3054.3863 3055.2142 3065.9790 3069.9909 3076.9163 3082.7671 3090.6326 3091.5783 3095.9674 3098.6897 3105.1410 3107.7877 3112.0318 3140.8994 3140.9663 3166.5924 3184.1489 3804.2032 3816.7346 3823.6866
redmass: 5.2577 4.1081 3.6237 4.2129 4.0457 1.6803 3.7036 1.8359 2.1959 1.1333 1.5240 1.9413 1.3535 1.5407 1.7525 2.6651 3.0020 2.4744 2.4811 3.5973 2.6898 2.2765 2.9096 3.3113 2.3328 2.2792 3.9823 2.4613 3.8132 3.5854 3.9519 3.6249 3.6638 2.7293 2.1041 3.0279 2.2057 2.7465 2.1480 1.8995 2.1972 2.3147 2.1694 2.1118 2.8082 2.0598 1.7628 1.8049 2.0051 1.8542 3.0968 2.7023 2.9268 2.6843 2.0490 2.2337 2.1683 1.6302 1.9611 1.8945 1.6819 2.1777 2.1343 1.4183 1.4175 1.5397 1.2550 1.4541 1.6237 1.3944 1.7479 1.4117 1.4084 1.5212 1.3277 1.3218 1.2985 1.2850 1.2633 1.2163 1.2193 1.3264 1.2142 1.3313 1.2048 1.4557 1.0553 1.0615 1.0537 1.0688 1.0772 1.0635 1.0704 1.0726 1.0748 7.2388 1.0354 1.0438 1.0624 1.0628 1.0698 1.0686 1.0801 1.0784 1.0846 1.1017 1.1007 1.0997 1.1023 1.1051 1.1018 1.0683 1.0950 1.0849 1.1001 1.0969 1.0973 1.0666 1.0661 1.0667
irintensity: 3.9617 3.8115 4.1374 4.9469 0.2269 2.2459 7.4784 2.8010 8.7836 107.0202 36.1407 42.0596 137.1565 113.1158 81.4957 17.1393 7.6258 5.2418 21.6462 1.6401 1.2815 6.7511 5.6051 3.4212 3.2175 8.3045 1.6373 10.7017 1.0830 2.2133 6.3266 1.8029 0.8057 5.4343 31.9717 11.0551 47.5069 5.0891 21.9172 10.0406 0.6269 4.6565 1.3599 33.3317 137.2790 45.7588 27.0098 45.0297 62.6382 61.8007 58.9476 112.5299 55.7491 27.3648 35.0689 14.1826 15.2682 13.1830 8.5791 21.7226 5.5956 9.8494 4.8365 14.8170 25.1274 11.1606 13.9501 25.1070 2.2496 2.1796 2.2008 6.8637 1.5517 1.2950 4.8493 6.0927 5.8369 3.3702 39.9570 50.1140 13.0462 10.8151 41.0147 31.9503 16.1490 12.7104 5.8847 6.5390 3.6886 11.3311 6.1236 27.5212 6.2381 15.3220 19.3506 10.4848 45.8526 52.0416 38.6083 20.5955 44.1739 75.4607 203.2927 8.9548 15.8575 66.7478 33.3116 119.1214 53.2228 54.1820 64.8555 33.1143 58.7250 14.1654 49.6215 62.3240 28.2155 33.5586 44.7318 45.4203
temp: 298.150 k
press: 1.00000 atm
elementType: 6 6 6 6 6 6 6 1 1 1 1 6 1 6 6 6 1 6 1 1 8 1 1 1 1 6 1 1 1 1 1 6 1 1 8 1 8 1 6 1 1 1
symmnumber: 1
zpe: 982058.1 jmol-1
zpe.correction: 0.374046 hartree
zpe.thermalcorrener: 0.391181 hartree
zpe.thermalcorrenthalpy: 0.392125 hartree
zpe.thermalcorrgfe: 0.332434 hartree
zpe.sumelectzpe: -811.414288 hartree
zpe.sumelectthermal: -811.397154 hartree
zpe.sumelectthermalent: -811.396210 hartree
zpe.sumelectthermalfe: -811.455900 hartree
dipole: 1.5891 2.5601 2.0867
dipole: 3.6652
quadrupole: -138.3580 -112.4753 -106.5727
quadrupole: -8.3928 -0.8475 -5.7076
quadrupole: -19.2227 6.6601 12.5626 -8.3928 -0.8475 -5.7076
hfenergy: -811.7883345 hartree
pointgroup: C01[X(C15H24O3)]
dipole: 0.6186612 1.0111512 0.8211154 debye
polarizability: 245.869207|4.9032702|246.1195309|4.2357289|3.9812396|220.0831321 unknown
InChI: InChI=1/15C.3O.24H
charge 0 multiplicity 1
42 atoms
C  -0.07367208 1.19434667 1.58385304
C  -0.34044216 -0.33523012 1.43380742
C  -0.86792524 -0.72841541 0.01754752
C  -0.14623957 2.00763134 0.25543491
C  -2.21817395 -0.10011542 -0.46349382
C  -1.61283456 2.30582212 0.00999336
C  -2.51095335 1.36207251 -0.27569865
H  -0.78954581 1.63580383 2.28386717
H  0.91250371 1.33794797 2.03851728
H  -1.01273787 -0.66342732 2.23313156
H  -2.99969774 -0.6520927 0.06659205
C  0.42944846 1.20593566 -0.9625944
H  -0.14589187 1.4834817 -1.85123811
C  0.40729335 -0.33765368 -0.80258926
C  1.6199209 -0.92012804 0.0419878
C  1.01036175 -1.0914478 1.47551453
H  0.87419146 -2.15081983 1.71330587
C  -1.15994939 -2.25812107 -0.04952207
H  -0.27645784 -2.8612395 0.1387613
H  -1.51871139 -2.49721305 -1.05224839
O  -2.20280895 -2.67162357 0.85103848
H  -1.84341849 -2.71043948 1.74727498
H  1.66617272 -0.6911502 2.25615205
H  0.40385623 -0.79119313 -1.79946986
H  1.44133698 1.5621137 -1.17127799
C  0.61521099 3.3345379 0.41551421
H  0.21093789 3.91795761 1.25088535
H  1.67838226 3.15930119 0.61008761
H  0.53255518 3.94242778 -0.49301953
H  -3.55426874 1.63200125 -0.42905786
H  -1.93841286 3.34002328 0.11767597
C  2.84807754 0.01432651 0.1560275
H  2.57422286 0.98260651 0.58884575
H  3.56401077 -0.45011866 0.84102232
O  3.58253159 0.20445686 -1.06173607
H  3.00916661 0.61629885 -1.7221323
O  -2.45678818 -0.44282528 -1.85967125
H  -1.95347949 0.17494894 -2.40846548
C  2.14544632 -2.24348247 -0.55442886
H  1.35664741 -2.97496769 -0.73344554
H  2.6448292 -2.05708694 -1.50919818
H  2.87655736 -2.69902579 0.12394764
