program: Gaussian 09
title: 000070013
version: EM64L-G09RevD.01
frameworkgroup: C1[X(C11H11F)]
method: RPBEPBE
basis: SDD
operation: Freq
keyword: #pfreq=noraman
keyword: PBEPBE/SDD
title: #p freq=noraman PBEPBE/SDD
converged: YES YES NO NO
title: Mulliken charges:
elementType: F C C C C C C C C C C C H H H H H H H H H H H
charge: -0.207006 -0.305154 -0.497268 -0.511044 0.447555 0.312465 -0.742552 -0.341352 -0.370856 -0.386110 -0.376917 0.320149 0.257259 0.244117 0.242917 0.237413 0.228088 0.220545 0.219883 0.259317 0.241385 0.252895 0.254270
chargesum: 0.00000
title: Mulliken charges with hydrogens summed into heavy atoms:
elementType: F C C C C C C C C C C C
charge: -0.207006 -0.047894 -0.010234 -0.045543 0.447555 0.312465 -0.302124 -0.082035 -0.129471 -0.133215 -0.122646 0.320149
polarizability: 1.62273145e+02 8.54653241e+00 1.24958834e+02 -1.97964016e+00 -1.11882648e+00 6.29711861e+01
1716.lowfreq: -6.5052 0.0005 0.0007 0.0010 5.1523 11.4753 46.1292 66.8117 95.3443
frequency: 46.0687 66.7643 95.3408 147.2519 221.7970 268.1213 313.7903 324.0740 377.5526 415.5968 431.0659 505.0933 518.9670 617.3030 636.9679 663.5151 681.5736 741.9437 768.0851 798.8779 816.2720 820.1455 832.9272 844.9703 899.9716 924.1491 941.8453 949.1782 960.8142 1004.0887 1040.1787 1070.4930 1080.0888 1100.0461 1107.7881 1110.7951 1157.5667 1168.9682 1199.3995 1205.6223 1266.5835 1295.9522 1362.4194 1386.1173 1407.2861 1429.2197 1441.2885 1468.4498 1495.9102 1590.7579 1609.3701 1635.7975 3091.7814 3096.8281 3107.0444 3109.7241 3147.2513 3155.4095 3174.1470 3177.9456 3193.5331 3207.5103 3212.3389
redmass: 3.7073 2.7140 6.0001 3.5634 3.6759 5.5062 3.4317 4.4154 4.8786 2.9908 3.9351 2.6282 3.7894 4.6003 4.8346 2.3933 1.4711 2.4171 1.7775 1.6181 1.4079 1.6112 2.1215 1.7359 2.6490 1.4025 2.5062 1.3541 1.3557 2.8938 1.1925 1.2893 1.7356 1.5738 1.2088 1.3832 1.5124 1.4013 2.0017 2.2748 2.0013 1.2697 5.1543 2.2155 3.3500 1.2944 1.1414 1.3040 2.6673 7.0666 6.3961 4.9338 1.0572 1.0775 1.0631 1.0655 1.0885 1.0881 1.0961 1.0971 1.1171 1.1135 1.1145
irintensity: 0.1088 0.1571 0.1769 0.0673 1.7629 1.7520 0.8117 0.7846 1.2796 0.0461 3.6774 17.2395 11.3109 0.3119 0.9216 6.4324 6.8582 4.3306 16.9004 10.6011 0.8011 2.0145 38.0745 56.9066 8.6333 58.0045 18.6781 0.5219 0.7440 9.5136 29.4455 12.4087 12.9764 1.7093 0.6456 9.8414 48.4516 1.7662 10.1067 21.1651 29.8880 1.9690 0.9381 22.2013 4.5708 5.3892 13.3490 2.3621 103.9519 2.8688 25.6690 28.4598 15.6247 15.0927 8.3284 6.9252 6.6804 4.8779 7.2645 2.8598 0.3307 23.6522 18.2653
temp: 298.150 k
press: 1.00000 atm
elementType: 9 6 6 6 6 6 6 6 6 6 6 6 1 1 1 1 1 1 1 1 1 1 1
symmnumber: 1
zpe: 484115.1 jmol-1
zpe.correction: 0.184390 hartree
zpe.thermalcorrener: 0.195049 hartree
zpe.thermalcorrenthalpy: 0.195994 hartree
zpe.thermalcorrgfe: 0.147426 hartree
zpe.sumelectzpe: -524.697086 hartree
zpe.sumelectthermal: -524.686427 hartree
zpe.sumelectthermalent: -524.685482 hartree
zpe.sumelectthermalfe: -524.734050 hartree
dipole: 2.3184 -0.0053 0.1286
dipole: 2.3220
quadrupole: -76.6210 -62.8256 -73.2175
quadrupole: -3.6641 0.4249 -1.1206
quadrupole: -5.7329 8.0624 -2.3295 -3.6641 0.4249 -1.1206
hfenergy: -524.8814759 hartree
pointgroup: C01[X(C11H11F1)]
dipole: -0.8924347 -0.1952894 0.0012245 debye
dipolederiv: -1.1918394 -0.2113681 -0.2322204 -0.2203126 -0.2011786 -0.0643754 -0.2299692 -0.0644631 -0.2608439 -0.2185612 0.066164 0.1327409 0.121155 0.1257901 -0.0934153 0.1210587 -0.0205516 -0.037893 0.0709576 -0.0079722 -0.0591742 -0.0375934 -0.0915449 -0.0821289 0.0301251 -0.1208786 -0.010178 -0.1997851 -0.0705712 -0.0276499 -0.1162231 0.0405219 -0.0291722 -0.0603468 -0.0777581 0.0481589 0.4471711 0.1000813 -0.0418082 0.2440818 -0.0378369 -0.0294955 -0.1813837 -0.0500407 0.3238895 0.0902922 -0.0032244 0.1236433 -0.0633041 -0.0164692 -0.0392227 0.1952384 0.0248692 -0.1091122 -0.2164346 0.1139855 -0.0958756 0.0924453 -0.3289833 -0.0303589 -0.0404662 -0.094146 -0.2663414 0.0197302 0.0317014 -0.001294 -0.0261188 -0.1185536 0.0685119 -0.0830318 0.0356854 0.0313215 -0.016677 0.0207567 -0.046694 0.0542679 -0.1052942 0.064768 -0.0083258 0.0817391 0.0650486 -0.2759943 -0.0267457 -0.0586215 0.0432568 -0.1449746 0.0427842 0.1656496 0.0697996 0.0159742 -0.1621054 -0.0177133 -0.0434071 -0.0732577 -0.1586872 0.0112633 -0.2418995 -0.0092841 -0.0906607 1.2244938 0.2300866 0.2244298 0.2363998 0.1443482 0.0948643 0.2314943 0.0960164 0.2913909 -0.0141474 0.0777597 0.0036819 0.0670235 0.0087122 0.082653 -0.0087662 0.0874529 -0.0043002 0.1340286 -0.0190532 -0.0059859 -0.0097206 -0.0879271 0.0140217 -0.006376 0.0535328 0.0338718 0.100076 -0.0004901 0.0255846 0.01082 0.0546469 -0.0068495 0.0339363 -0.0231987 -0.1310893 -0.005045 -0.0892404 0.0281258 -0.117923 -0.0118443 0.0600922 0.0451537 0.0808976 0.0522112 0.0630148 -0.0131737 -0.0413822 -0.0014943 0.0707886 0.0518999 -0.1295773 0.0378443 -0.0452163 -0.0892404 -0.0683104 -0.05751 -0.094086 0.1406226 -0.0144486 -0.0463021 0.0087817 0.0959235 0.0227586 -0.0709007 0.1057611 -0.0754894 0.1474842 0.0776593 0.0983927 0.0610765 -0.0028075 0.0534607 0.0177201 0.0935364 0.0290791 0.131873 -0.0209108 0.1073853 -0.0188003 0.0171187 0.0909793 -0.0310617 -0.0624886 -0.0284103 0.1131187 -0.0615707 -0.0235153 -0.0657615 -0.0381134 0.0759228 -0.0234153 -0.0349311 -0.0310303 0.1567046 -0.0614843 -0.0522174 -0.0636819 -0.022351 -0.0030557 -0.0050147 0.0715389 -0.0035657 0.1686832 -0.0350849 0.0837432 -0.0291307 0.0439982 unknown
polarizability: 159.6861847|15.0268059|67.2152193|7.3873542|11.9882994|123.301762 unknown
InChI: InChI=1S/C11H11F/c1-8(9-2-3-9)10-4-6-11(12)7-5-10/h4-7,9H,1-3H2
charge 0 multiplicity 1
23 atoms
F  4.09826 0.857242 0.61679
C  -2.230173 -0.746282 0.47057
C  -3.062312 0.312703 1.241708
C  -3.758854 -0.756829 0.391476
C  -1.351102 -0.338133 -0.682473
C  0.075816 -0.031133 -0.348168
C  -1.828049 -0.240533 -1.958206
C  0.44086 0.383843 0.964108
C  1.109829 -0.158087 -1.319183
C  1.778423 0.686931 1.296198
C  2.452055 0.140689 -1.010119
C  2.756323 0.561984 0.296319
H  -1.78646 -1.522119 1.108023
H  -3.048321 1.334821 0.851312
H  -3.117651 0.237012 2.332228
H  -4.286001 -1.563937 0.907814
H  -4.240838 -0.429359 -0.533529
H  -2.858427 -0.512976 -2.204974
H  -1.210237 0.124296 -2.785953
H  -0.334862 0.488261 1.728382
H  0.865808 -0.522011 -2.322455
H  2.060977 1.014008 2.301059
H  3.249235 0.037608 -1.752027
