program: Gaussian 09
title: 000069989
version: EM64L-G09RevD.01
frameworkgroup: C1[X(C9H11Cl)]
method: RPBEPBE
basis: SDD
operation: Freq
keyword: #pfreq=noraman
keyword: PBEPBE/SDD
title: #p freq=noraman PBEPBE/SDD
converged: YES YES NO NO
title: Mulliken charges:
elementType: Cl C C C C C C C C C H H H H H H H H H H H
charge: -0.106652 0.349866 0.424343 0.463713 -0.568542 -0.372878 -0.408507 -0.823630 -0.791231 -0.808399 0.236001 0.232619 0.234023 0.225817 0.252108 0.230288 0.273233 0.267524 0.226340 0.238789 0.225174
chargesum: 0.00000
title: Mulliken charges with hydrogens summed into heavy atoms:
elementType: Cl C C C C C C C C C
charge: -0.106652 0.349866 0.424343 0.463713 -0.332541 -0.140259 -0.174484 -0.115416 -0.250474 -0.118096
polarizability: 1.48614587e+02 2.88243419e+00 1.04879530e+02 3.64293732e+00 -3.44868758e+00 6.77225188e+01
1716.lowfreq: -28.6606 -12.0186 -5.2594 -0.0018 0.0006 0.0024 3.6407 63.5656 80.9348
frequency: -28.1007 63.5481 80.9283 128.2992 175.2087 202.4086 273.9963 302.2672 333.0424 427.1506 443.7114 480.4952 533.5662 543.8717 611.1093 713.0784 740.0838 765.1585 832.4307 890.1247 893.5533 939.9851 960.4729 982.5447 1019.8535 1043.9435 1048.6651 1098.9599 1146.7156 1171.5399 1228.2879 1240.5569 1265.1117 1294.8567 1377.1909 1396.4821 1398.0284 1407.8318 1459.4016 1469.9692 1472.4690 1473.2548 1482.0738 1501.9243 1583.3662 1623.4164 2972.0092 2975.6881 3050.3592 3057.1552 3068.5898 3086.5403 3088.7438 3115.8567 3117.8727 3143.2090 3148.5482
redmass: 1.0197 5.1922 5.1432 1.0590 5.1278 2.7644 2.5340 2.3258 4.9394 2.7887 2.7483 4.6899 4.1289 4.4920 3.8447 5.2042 3.4480 3.4093 1.4100 1.3945 1.5679 2.7306 1.3759 1.4746 1.4913 1.5419 1.5950 1.3329 1.5002 1.5129 1.8099 1.2364 3.6281 1.4046 5.8172 1.2358 1.2679 2.6196 1.1543 1.0575 1.1087 1.0753 1.2253 2.3613 6.3227 6.3749 1.0389 1.0388 1.0952 1.0947 1.0576 1.0998 1.0989 1.0912 1.0874 1.0973 1.1108
irintensity: 0.6124 1.2483 1.9872 0.8129 2.6532 3.4454 1.1371 1.2341 6.7097 0.6367 3.8112 17.6312 21.9332 0.6140 66.1330 4.3880 7.6067 13.7922 29.5303 3.3751 0.8213 4.1169 0.3093 0.7418 2.9119 3.2021 24.9115 2.5861 6.2655 3.2453 5.2090 37.8214 15.9632 1.2025 1.9966 19.9364 9.9738 1.3188 10.0036 17.6812 9.7300 17.9942 16.0551 7.4446 5.5870 44.0344 27.9553 29.5693 16.1951 22.6877 21.6465 16.8158 15.8425 24.4948 9.5061 17.6849 9.3744
temp: 298.150 k
press: 1.00000 atm
elementType: 17 6 6 6 6 6 6 6 6 6 1 1 1 1 1 1 1 1 1 1 1
symmnumber: 1
zpe: 450666.2 jmol-1
zpe.correction: 0.171650 hartree
zpe.thermalcorrener: 0.181379 hartree
zpe.thermalcorrenthalpy: 0.182323 hartree
zpe.thermalcorrgfe: 0.135961 hartree
zpe.sumelectzpe: -808.887131 hartree
zpe.sumelectthermal: -808.877402 hartree
zpe.sumelectthermalent: -808.876458 hartree
zpe.sumelectthermalfe: -808.922820 hartree
dipole: -2.4436 0.4553 1.5139
dipole: 2.9104
quadrupole: -67.9247 -61.0325 -68.8546
quadrupole: 1.2697 6.4678 -1.4727
quadrupole: -1.9874 4.9048 -2.9173 1.2697 6.4678 -1.4727
hfenergy: -809.0587806 hartree
pointgroup: C01 [X(C9H11Cl1)]
dipole: -0.9175233 -0.1959347 -0.656438 debye
dipolederiv: -0.7423817 -0.0605699 -0.1536869 -0.0301272 -0.208633 -0.0022267 -0.5621373 -0.0469914 -0.4282656 0.1885886 -0.2051713 -0.0123426 -0.052774 0.2595436 0.0260007 -0.0114371 0.0222881 -0.0065852 -0.3520406 -0.02476 -0.0098253 0.0616778 -0.1435665 0.0096807 0.1737972 0.0307949 -0.1538407 0.4471376 0.0187336 -0.0872482 0.0422764 0.0713462 -0.0085638 -0.1699195 -0.0201724 0.0172613 -0.3188313 0.175381 -0.0093901 0.1937081 -0.0102911 -0.0404264 0.0099818 -0.0540474 -0.1777106 0.1250249 0.061508 -0.0384091 -0.0791268 0.0635878 -0.041492 -0.0549092 -0.0235975 -0.126263 -0.2514861 -0.1209485 0.0029888 -0.2269235 -0.0198156 -0.0017474 0.0497005 0.0084484 -0.1761153 -0.0679117 0.1474941 -0.0257905 0.0899567 -0.0699145 -0.0063478 -0.0297423 -0.0370825 0.0443983 1.0165387 0.0930229 0.258946 0.0618819 0.1776196 -0.0124399 0.4891064 0.0254498 0.5288968 -0.1524453 -0.01522 0.0464278 -0.0200095 0.0739074 0.000795 0.1752426 0.0082873 0.0364475 0.0391 -0.0702236 0.0158134 -0.0904194 -0.0836974 0.0346264 0.0190638 0.03591 0.1372526 0.0352452 -0.0960784 0.033283 -0.0705723 -0.0684985 0.0305315 0.0162283 0.035589 0.1322515 -0.0074649 0.1101113 0.0047094 0.1058488 -0.0429284 0.0068148 0.0107788 0.0096332 0.153328 0.0474474 0.0615321 0.090691 0.0418836 0.0376561 -0.0005354 0.1051139 -0.0621302 -0.0865405 -0.010738 0.0443395 -0.0861032 0.0070316 0.0814544 -0.0309725 -0.0955556 0.0203569 0.0293076 0.0141711 -0.1566736 0.0443878 -0.0504812 -0.0652768 0.037602 0.0310563 0.0602463 0.0947143 0.0295883 0.0050747 -0.0540942 -0.0828463 -0.0478001 0.091398 -0.0470587 0.0537639 -0.0132987 -0.0293719 0.0250162 -0.02392 0.093452 0.0121247 -0.0975699 -0.0531562 -0.0673468 -0.0367529 0.0126736 -0.0311506 -0.0081159 -0.1134952 -0.0827428 -0.0773748 -0.0620513 -0.0707577 0.0818679 -0.0116522 -0.0055453 0.0360429 -0.0045448 0.1120134 -0.0045385 0.0909231 -0.0041121 -0.1175808 -0.0111914 0.044128 -0.0243641 0.1236034 -0.0460885 0.0867861 -0.0850255 0.0754703 0.0672276 unknown
polarizability: 148.8309616|-1.8353984|104.799575|1.6546615|-3.5774673|67.5860992 unknown
InChI: InChI=1S/C9H11Cl/c1-7-3-4-9(6-10)8(2)5-7/h3-5H,6H2,1-2H3
charge 0 multiplicity 1
21 atoms
Cl 3.354024 0.440787 1.036186
C  0.270358 -0.973343 -0.126017
C  0.860338 0.309272 -0.353557
C  -1.95795 0.102092 0.091938
C  -1.125692 -1.047202 0.089034
C  0.034092 1.461754 -0.348514
C  -1.355382 1.364973 -0.134074
C  1.115068 -2.234781 -0.106961
C  2.325416 0.460994 -0.608135
C  -3.447893 -0.017075 0.358401
H  -1.580671 -2.031048 0.261822
H  0.490852 2.444916 -0.516008
H  -1.974715 2.269602 -0.140753
H  1.552598 -2.449935 -1.101639
H  1.956488 -2.140756 0.604053
H  0.512592 -3.111043 0.185562
H  2.585616 1.430579 -1.054422
H  2.771609 -0.364946 -1.179233
H  -3.855365 -0.967946 -0.028076
H  -3.658495 0.011497 1.44541
H  -4.01009 0.811707 -0.106216
