program: Gaussian 09
title: 000069977
version: EM64L-G09RevD.01
frameworkgroup: C1[X(C8H12)]
method: RPBEPBE
basis: SDD
operation: Freq
keyword: #p
keyword: freq=noraman
keyword: PBEPBE/SDD
title: #p freq=noraman PBEPBE/SDD
converged: YES YES NO NO
title: Mulliken charges:
elementType: C C C C C C C C H H H H H H H H H H H H
charge: -0.278234 -0.278187 -0.504130 -0.500320 -0.500328 -0.504158 0.539255 -0.774387 0.245320 0.245338 0.227520 0.232124 0.239116 0.237797 0.239120 0.237777 0.227530 0.232120 0.218372 0.218355
chargesum: 0.00000
title: Mulliken charges with hydrogens summed into heavy atoms:
elementType: C C C C C C C C
charge: -0.032914 -0.032849 -0.044486 -0.023407 -0.023431 -0.044508 0.539255 -0.337660
polarizability: 9.45422605e+01 -2.20855575e-03 8.70529296e+01 -8.30708799e-01 -2.36023801e-03 6.53489558e+01
1716.lowfreq: -5.2043 -0.0007 -0.0005 -0.0002 6.4020 13.0993 50.1695 55.1483 180.5184
frequency: 50.1649 55.1420 180.5183 186.1110 275.4338 310.3956 419.7812 471.2052 630.6953 682.2037 723.1696 774.1627 796.6483 809.3418 824.9465 825.5775 888.3755 906.1418 925.1586 931.9543 950.4690 1038.6559 1039.6754 1070.8101 1071.2492 1088.9768 1091.7441 1099.2444 1103.3739 1162.1121 1169.6783 1170.9170 1206.5276 1230.0392 1350.5910 1405.5503 1422.6411 1438.8819 1440.7405 1467.4829 1468.3827 1658.0764 3088.5886 3089.6883 3093.1560 3094.0580 3101.2849 3105.7313 3106.4836 3191.5559 3191.9746 3201.3869 3210.2078 3210.2128
redmass: 2.8102 2.4949 2.7246 2.8172 3.0667 2.6970 2.9705 2.2503 2.8093 1.5300 1.2723 1.3587 1.1199 1.3725 1.4911 1.8650 2.9942 2.8419 1.3761 3.4450 2.0218 1.2053 1.1850 1.2637 1.2739 1.4351 1.5406 1.1587 1.1480 1.9395 1.3979 1.8140 1.9498 1.4030 1.5861 2.2631 1.2217 1.0902 1.1119 1.3778 1.2893 5.4156 1.0827 1.0755 1.0525 1.0587 1.0619 1.0656 1.0661 1.1169 1.1170 1.1137 1.1149 1.1150
irintensity: 0.0700 0.1609 0.2909 1.6263 0.0148 0.4571 0.0370 2.1626 13.2598 0.1371 0.1560 7.5776 1.5671 2.3694 14.0021 15.6056 9.2274 0.2950 70.9872 0.4399 16.1012 6.4604 43.2645 20.2201 5.3589 1.8344 22.6992 1.3644 0.3703 4.6974 1.4802 5.3178 0.0019 11.6361 0.3235 17.8643 3.5316 11.5306 11.1009 2.4548 3.3894 32.7925 19.6662 2.3323 20.3525 33.3380 6.0513 24.1330 0.0054 0.4795 0.1631 27.3098 20.3229 32.8384
temp: 298.150 k
press: 1.00000 atm
elementType: 6 6 6 6 6 6 6 6 1 1 1 1 1 1 1 1 1 1 1 1
symmnumber: 1
zpe: 457555.3 jmol-1
zpe.correction: 0.174274 hartree
zpe.thermalcorrener: 0.182696 hartree
zpe.thermalcorrenthalpy: 0.183641 hartree
zpe.thermalcorrgfe: 0.140636 hartree
zpe.sumelectzpe: -311.337083 hartree
zpe.sumelectthermal: -311.328660 hartree
zpe.sumelectthermalent: -311.327716 hartree
zpe.sumelectthermalfe: -311.370720 hartree
dipole: 0.0001 -0.7099 0.0002
dipole: 0.7099
quadrupole: -49.2762 -47.5404 -50.4109
quadrupole: -0.0003 -1.6307 -0.0011
quadrupole: -0.2003 1.5354 -1.3351 -0.0003 -1.6307 -0.0011
hfenergy: -311.5113565 hartree
pointgroup: C01 [X(C8H12)]
dipole: 0.0003607 0.2792765 -0.0002672 debye
dipolederiv: -0.2454671 0.0437458 0.105326 0.0219034 0.0656006 0.0094094 0.1518264 -0.0339456 0.1078157 -0.2451704 -0.0424099 0.1053833 -0.0207625 0.0658566 -0.0095778 0.1519962 0.0333888 0.1076156 -0.1616947 -0.0940881 -0.0295398 -0.1036923 -0.0093791 -0.0908278 -0.0930379 -0.0535055 0.0423266 0.0601004 -0.0423566 0.0185122 0.0503066 -0.0118951 -0.1299387 0.0136482 -0.0988978 -0.0982466 0.0599316 0.0421161 0.0187639 -0.0503438 -0.0115148 0.1298645 0.0139057 0.0988045 -0.098573 -0.1611834 0.0945715 -0.029313 0.1040783 -0.009831 0.0909226 -0.0927354 0.0539017 0.0422069 0.5013864 -0.0003393 0.0119513 -0.0001841 0.3676542 -0.0006067 0.1913689 -0.0007314 -0.1580961 -0.1144828 -0.0001611 0.1722898 -0.0000967 -0.3174372 -0.0003104 0.0745655 -0.0001063 -0.3644054 -0.0017243 0.0114675 0.0562437 -0.0130104 -0.0209253 0.1063845 0.0224346 0.1208703 0.0060544 -0.0017125 -0.011588 0.0559658 0.0128717 -0.02126 -0.1065289 0.0220852 -0.1208757 0.0063531 0.094851 -0.0019755 -0.0310164 -0.075953 -0.0940457 0.0301555 -0.021605 0.0411236 0.0759234 -0.0453888 0.018852 -0.1089456 0.029536 0.0599753 0.0487603 -0.1280182 0.0247075 0.003855 0.0508596 0.10692 0.0169279 0.0962354 -0.1019956 -0.0407802 0.0144642 -0.0160438 0.0494028 0.1127713 0.0239401 -0.0524902 0.0272561 0.0432292 0.0565574 -0.0184336 0.0161906 -0.0902988 0.0503086 -0.1073135 0.0171831 -0.0966539 -0.1013177 0.0409606 0.014612 0.0162247 0.049302 0.1126127 -0.024199 -0.0527467 -0.0275342 0.0433005 -0.0565483 -0.0185861 -0.0163092 -0.0901908 0.0950786 0.0013361 -0.0311105 0.075325 -0.0943462 -0.0299087 -0.0218652 -0.0408261 0.0760328 -0.0456813 -0.0186717 -0.1090576 -0.0294006 0.0600119 -0.0484737 -0.1280543 -0.0243925 0.0041005 -0.057375 0.1108948 -0.0672687 0.0942077 0.0438912 0.0102803 -0.0743506 0.0256641 0.1643729 -0.0580197 -0.1107412 -0.0670586 -0.0940885 0.0444286 -0.0097939 -0.0742208 -0.0252417 0.1644488 unknown
polarizability: 94.5329937|-0.0139593|87.0529231|-0.9797286|-0.0246736|65.3582292 unknown
InChI: InChI=1S/C8H12/c1-6(7-2-3-7)8-4-5-8/h7-8H,1-5H2
charge 0 multiplicity 1
20 atoms
C  -1.219748 0.441629 -0.302031
C  1.220489 0.438486 0.301776
C  -2.646562 -0.106729 -0.244339
C  -2.171723 0.869061 0.84316
C  2.172993 0.86167 -0.844519
C  2.645619 -0.114217 0.24388
C  -0.000917 -0.387798 0.000791
C  -0.003039 -1.748914 0.002379
H  -1.036782 1.22518 -1.0497
H  1.040288 1.223492 1.048596
H  -2.791363 -1.150627 0.048186
H  -3.365689 0.252881 -0.986003
H  -2.561748 1.891386 0.839821
H  -1.974999 0.455023 1.836879
H  2.566065 1.88283 -0.842662
H  1.974506 0.44699 -1.837622
H  2.786994 -1.1589 -0.047516
H  3.366334 0.2441 0.984624
H  0.888851 -2.324336 0.272836
H  -0.896666 -2.322207 -0.266835
