program: Gaussian 09
title: 000069938
version: EM64L-G09RevD.01
frameworkgroup: C1[X(CH3ClO3S)]
method: RPBEPBE
basis: SDD
operation: Freq
keyword: #p
keyword: freq=noraman
keyword: PBEPBE/SDD
title: #p freq=noraman PBEPBE/SDD
converged: YES YES NO NO
title: Mulliken charges:
elementType: Cl S O O O C H H H
charge: -0.155551 1.071990 -0.351497 -0.438576 -0.421626 -0.488489 0.258152 0.266250 0.259348
chargesum: 0.00000
title: Mulliken charges with hydrogens summed into heavy atoms:
elementType: Cl S O O O C
charge: -0.155551 1.071990 -0.351497 -0.438576 -0.421626 0.295260
polarizability: 7.19673558e+01 -3.91480351e+00 6.88022338e+01 -1.11505177e+00 -3.87371193e-01 4.79989665e+01
1716.lowfreq: -17.3299 -10.4673 -0.0008 -0.0007 0.0029 11.0993 71.5423 116.4217 151.5199
frequency: 71.5332 116.2738 151.5166 178.6496 210.3190 239.3750 292.2236 382.8701 414.0912 511.1243 861.3185 896.5615 996.4571 1094.4901 1109.5938 1398.6270 1421.7872 1465.0941 2982.3986 3098.3720 3112.2134
redmass: 3.1792 1.3930 3.3847 10.2414 5.9027 19.2073 10.9747 6.7965 14.8336 11.1682 18.1453 8.4795 17.3367 1.3578 1.2691 1.1152 1.0461 1.0575 1.0272 1.1044 1.1052
irintensity: 4.0230 0.7512 3.1239 1.9775 3.1378 0.2681 10.7812 25.5659 73.9697 99.2186 75.4090 23.5031 64.0928 7.9162 2.5452 7.7767 22.1928 30.2613 6.9908 8.4962 14.0030
temp: 298.150 k
press: 1.00000 atm
elementType: 17 16 8 8 8 6 1 1 1
symmnumber: 1
zpe: 125637.1 jmol-1
zpe.correction: 0.047853 hartree
zpe.thermalcorrener: 0.055954 hartree
zpe.thermalcorrenthalpy: 0.056898 hartree
zpe.thermalcorrgfe: 0.014380 hartree
zpe.sumelectzpe: -1123.010025 hartree
zpe.sumelectthermal: -1123.001924 hartree
zpe.sumelectthermalent: -1123.000980 hartree
zpe.sumelectthermalfe: -1123.043497 hartree
dipole: -2.8106 -2.5731 0.3762
dipole: 3.8291
quadrupole: -45.6498 -49.4033 -54.8121
quadrupole: 4.3580 -0.1764 0.5298
quadrupole: 4.3053 0.5518 -4.8570 4.3580 -0.1764 0.5298
hfenergy: -1123.0578779 hartree
pointgroup: C01 [X(C1H3Cl1O3S1)]
dipole: 1.414204 0.4267556 0.2955897 debye
dipolederiv: -0.3137572 0.1021577 0.0555942 0.2319579 -0.5403229 -0.1948032 0.1481722 -0.1790439 -0.3152209 1.5346257 -0.084754 -0.0366013 -0.0465138 1.6552789 0.1976501 -0.2508787 0.1588484 1.2825365 -0.643335 -0.0231618 -0.0838303 -0.0643147 -0.4227809 -0.0541255 0.0620651 -0.0277227 -0.4347887 -0.4464958 0.0605476 -0.0380589 -0.0396556 -0.5680777 0.0302714 0.0383659 0.1147265 -0.4400374 -0.4657609 -0.0521033 -0.0377265 -0.0655275 -0.4499996 -0.0366213 -0.0709902 -0.0963016 -0.4753987 0.1971677 -0.0311358 0.0661176 -0.1030218 0.198944 0.0343198 0.344729 0.0762614 0.2139517 0.0552525 0.0889614 0.0494021 0.0612108 0.0120105 -0.0792938 -0.0877316 -0.0862555 0.0526074 0.0176791 -0.0512922 0.0473902 -0.0181655 0.1433184 0.0172654 -0.0615433 -0.0016513 0.0705761 0.064624 -0.0092196 -0.0222872 0.0440303 -0.0283706 0.0853372 -0.1221886 0.0411387 0.045774 unknown
polarizability: 68.8245862|-3.231572|65.9762551|-2.1941248|10.4323536|53.9677148 unknown
InChI: InChI=1S/CH3O3S.Cl/c1-4-5(2)3;/h1H3;
charge 0 multiplicity 1
9 atoms
Cl -1.18201 1.367852 0.87079
S  -0.377843 -0.620921 -0.236948
O  1.178584 0.063861 -0.935158
O  -0.055925 -1.688941 0.91893
O  -1.299661 -0.957431 -1.495771
C  2.177487 0.44055 0.088676
H  1.803468 1.273539 0.710878
H  3.028063 0.782473 -0.52556
H  2.471239 -0.424581 0.707062
