program: Gaussian 09
title: 000069911
version: EM64L-G09RevD.01
frameworkgroup: C1[X(C16H12O)]
method: RPBEPBE
basis: SDD
operation: Freq
keyword: #pfreq=noraman
keyword: PBEPBE/SDD
title: #p freq=noraman PBEPBE/SDD
converged: NO YES NO NO
title: Mulliken charges:
elementType: O C C C C C C C C C C C C C C C C H H H H H H H H H H H H
charge: -0.177932 0.070173 0.212078 0.212097 0.461767 0.461782 -0.781371 -0.361777 -0.361763 -0.450202 -0.450211 -0.001280 -0.254110 -0.254128 -0.243963 -0.243960 -0.737135 0.246435 0.244614 0.244609 0.245439 0.245440 0.229950 0.229949 0.230711 0.230711 0.251566 0.248936 0.251575
chargesum: 0.00000
title: Mulliken charges with hydrogens summed into heavy atoms:
elementType: O C C C C C C C C C C C C C C C C
charge: -0.177932 0.070173 0.212078 0.212097 0.461767 0.461782 -0.534936 -0.117163 -0.117154 -0.204762 -0.204771 -0.001280 -0.024161 -0.024179 -0.013252 -0.013248 0.014942
polarizability: 2.91283644e+02 -5.01874191e-03 1.89153542e+02 -7.75064260e-04 -4.10043372e+00 8.23403487e+01
1716.lowfreq: -127.9940 -53.0027 -4.7650 0.0006 0.0007 0.0008 6.8536 8.9494 73.6868
frequency: -127.9921 -52.9756 73.6840 97.1210 114.6252 130.3403 207.5363 233.3531 237.0600 326.1398 349.0511 390.4242 394.2784 432.4578 469.3742 498.3686 500.2870 541.3957 573.5010 590.4824 624.6248 638.1865 655.2529 673.5280 748.9927 750.3683 768.9489 815.2278 824.0148 834.0851 862.8278 868.5150 911.0467 925.3759 935.9560 962.3456 970.4719 990.0640 990.8932 993.9411 1008.9843 1020.0403 1026.3853 1105.7394 1138.8498 1171.0059 1175.7679 1186.0570 1197.4938 1250.8613 1281.0854 1294.2078 1340.2095 1362.8944 1364.7531 1384.7216 1415.5542 1436.5451 1444.6372 1447.3545 1448.8690 1452.2131 1490.7518 1533.5180 1566.8401 1579.5127 1602.2768 1627.3137 1633.2954 2987.8469 3075.0602 3118.6208 3119.9196 3121.9253 3122.7363 3128.1781 3129.0882 3144.8412 3145.3157 3162.7740 3163.4539
redmass: 1.0308 4.2634 4.1602 4.7257 3.7370 5.5222 4.8111 4.7053 4.1363 4.1095 4.6244 6.4390 4.9254 3.3100 2.7469 4.3173 4.1130 3.3524 3.1560 4.8107 3.9685 6.1070 4.0645 5.6709 1.2777 3.4786 1.3461 2.1012 5.1671 3.8003 1.5944 1.5517 4.9385 2.4288 3.4487 1.3636 1.4660 1.3352 1.4529 1.6649 2.1619 2.4235 2.0279 2.1970 2.2422 1.1124 1.3540 1.4158 1.2917 1.6312 2.1393 1.8613 5.0344 2.9471 1.1915 1.7208 4.2381 6.8370 1.3924 1.9216 1.8811 1.1910 2.8626 6.7084 7.7355 5.3908 10.4099 6.4927 6.1469 1.0364 1.0966 1.1011 1.0902 1.0859 1.0869 1.0881 1.0882 1.0953 1.0954 1.1005 1.1005
irintensity: 0.1131 4.8618 0.9965 2.7804 0.0016 0.4130 1.0381 0.0192 3.0507 0.0970 1.2180 0.1851 0.0397 12.5746 0.0015 0.2201 0.1992 25.5581 3.9589 5.1731 2.2596 0.1608 15.0450 0.6614 108.2986 0.0049 0.0001 9.9776 2.2292 0.1580 21.6165 0.0014 0.1185 38.1742 12.1631 0.0440 11.2700 0.0001 3.0368 0.0782 0.1935 0.1621 12.5373 0.1887 36.9968 0.1305 60.5626 48.5950 3.0141 1.5437 3.6863 2.4239 12.5763 1.6507 54.9099 1.1461 3.9289 1.3111 19.3728 5.1528 1.3504 17.1201 0.8844 5.6929 0.5880 1.6233 113.5368 0.0084 3.9739 0.8597 4.1663 13.0997 1.8121 0.0822 11.0376 0.3250 0.8035 0.1318 62.0924 74.1976 0.2988
temp: 298.150 k
press: 1.00000 atm
elementType: 8 6 6 6 6 6 6 6 6 6 6 6 6 6 6 6 6 1 1 1 1 1 1 1 1 1 1 1 1
symmnumber: 1
zpe: 594015.6 jmol-1
zpe.correction: 0.226249 hartree
zpe.thermalcorrener: 0.238312 hartree
zpe.thermalcorrenthalpy: 0.239256 hartree
zpe.thermalcorrgfe: 0.188002 hartree
zpe.sumelectzpe: -690.983081 hartree
zpe.sumelectthermal: -690.971017 hartree
zpe.sumelectthermalent: -690.970073 hartree
zpe.sumelectthermalfe: -691.021328 hartree
dipole: 0.0001 -1.5990 2.6012
dipole: 3.0533
quadrupole: -82.0758 -90.9362 -107.4858
quadrupole: 0.0001 0.0009 7.5883
quadrupole: 11.4235 2.5630 -13.9865 0.0001 0.0009 7.5883
hfenergy: -691.2093291 hartree
pointgroup: C01 [X(C16H12O1)]
dipole: 0.0000204 -0.6450637 1.0133928 debye
polarizability: 291.2836432|-0.0085539|189.255804|-0.000346|-2.4249201|82.2380874 unknown
InChI: InChI=1S/C16H12O/c1-11(17)16-14-8-4-2-6-12(14)10-13-7-3-5-9-15(13)16/h2-10H,1H3
charge 0 multiplicity 1
29 atoms
O  0.000394 3.023219 -1.138322
C  0.000046 0.844024 -0.058214
C  -1.240877 0.144443 -0.039953
C  1.240827 0.144189 -0.039962
C  -1.235016 -1.315593 0.019483
C  1.234673 -1.315846 0.01947
C  -0.000243 -2.005495 0.050387
C  -2.514312 0.822834 -0.074846
C  2.514401 0.822316 -0.074878
C  -2.493519 -2.0176 0.045667
C  2.493032 -2.018111 0.045628
C  0.000188 2.362993 -0.064407
C  -3.708247 0.109444 -0.045341
C  3.708192 0.108685 -0.045386
C  -3.700096 -1.327304 0.017312
C  3.69975 -1.328061 0.017258
C  0.000782 3.066984 1.293668
H  -0.000353 -3.101802 0.098133
H  -2.536809 1.916137 -0.147396
H  2.537124 1.915616 -0.147418
H  -2.480334 -3.113357 0.086723
H  2.479621 -3.113866 0.086687
H  -4.665279 0.641632 -0.077887
H  4.665331 0.640681 -0.077937
H  -4.649998 -1.87245 0.036896
H  4.649541 -1.873401 0.036829
H  0.887987 3.7234 1.364463
H  0.000387 2.358959 2.136651
H  -0.885494 3.724629 1.364591
