program: Orca
programVersion: 5.0.3
elementType: C C C H H C C H H C H H C H C H C H H H C H H H H
charge: 0
multiplicity: 2
keywords: RKS RI-PBE-QIDH RIJCOSX def2-QZVP AutoAux TightSCF DEFGRID3 NL
formula: C10H15
InChI: InChI=1/C10H15/c1-7-2-9-4-8(1)5-10(3-7)6-9/h7-9H,1-6H2
25 atoms
C  0.966356 0.098786 0.450869
C  0.504288 -0.957874 -0.566161
C  -0.774703 -0.486186 -1.277447
H  1.297627 -1.133729 -1.305835
H  0.319847 -1.913824 -0.056774
C  -1.889728 -0.266146 -0.214073
C  -1.363356 0.774723 0.728913
H  -2.812506 0.064758 -0.708385
H  -2.100159 -1.211635 0.30278
C  -0.162413 0.314251 1.500618
H  0.156196 1.062199 2.238468
H  -0.358481 -0.626391 2.031744
C  1.231561 1.428925 -0.273575
H  1.882184 -0.241969 0.95434
C  -0.502437 0.846166 -1.995238
H  -1.09911 -1.243609 -2.005042
C  -0.044616 1.910013 -0.983894
H  0.272295 0.70407 -2.761426
H  -1.41011 1.186009 -2.512911
H  0.151091 2.859362 -1.502331
C  -1.165518 2.111002 0.077049
H  1.569274 2.187433 0.446097
H  2.038788 1.298087 -1.007548
H  -0.855712 2.874238 0.80289
H  -2.082326 2.461071 -0.415239
totalener: -388.99875461 hartree
nucrepener: 583.75058672 hartree
electener: -972.74934133 hartree
oneelecener: -1682.85126955 hartree
twoeener: 710.10192822 hartree
kineticenergy: 387.17858038 hartree
exchangeener: -17.668220857482 hartree
correlationener: -1.675526779170 hartree
xcener: -19.260271173289 hartree
s2: 0.758134
chargesum: 0.0000000
charge: -0.139239 -0.079333 -0.136433 0.072245 0.068969 -0.073685 -0.158681 0.064311 0.064045 -0.077170 0.065638 0.065775 -0.078780 0.074107 -0.078571 0.073515 -0.135252 0.070540 0.069816 0.072554 -0.073134 0.069523 0.071033 0.064320 0.063888
charge: -0.020605 0.126725 -0.020586 -0.039587 -0.039765 0.100289 -0.017352 -0.039553 -0.039546 0.100298 -0.039551 -0.039554 0.126781 -0.042201 0.126754 -0.042203 -0.020609 -0.039587 -0.039757 -0.042201 0.100273 -0.039775 -0.039613 -0.039551 -0.039522
qa: -0.1392 -0.0793 -0.1364 0.0722 0.0690 -0.0737 -0.1587 0.0643 0.0640 -0.0772 0.0656 0.0658 -0.0788 0.0741 -0.0786 0.0735 -0.1353 0.0705 0.0698 0.0726 -0.0731 0.0695 0.0710 0.0643 0.0639
va: 3.7995 3.8553 3.7994 1.0037 1.0055 3.8689 3.7162 1.0056 1.0057 3.8686 1.0056 1.0055 3.8559 0.9986 3.8550 0.9987 3.7995 1.0041 1.0056 0.9990 3.8683 1.0053 1.0043 1.0055 1.0055
total: -389.653930445 hartree
energy: -389.653930444806 hartree
dipole: 1.47469 -1.25077 0.22392 -0.27866 0.23635 -0.04231 -1.39138 1.17993 -0.21144
magnitude: 0.31087 au
magnitude: 0.79016 debye
