program: Gaussian 09
title: 000069929
version: EM64L-G09RevD.01
frameworkgroup: C1[X(C16H23NO4)]
method: RPBEPBE
basis: SDD
operation: Freq
keyword: #p
keyword: freq=noraman
keyword: PBEPBE/SDD
title: #p freq=noraman PBEPBE/SDD
converged: YES YES NO NO
title: Mulliken charges:
elementType: O O O O N C C C C C C C C C C C C C C C C H H H H H H H H H H H H H H H H H H H H H H H
charge: -0.266863 -0.265987 -0.242656 -0.252176 -0.124171 -0.364141 -0.501878 -0.491033 -0.507889 0.440425 0.267356 -0.369013 -0.450843 0.254461 -0.229571 -0.219377 -0.245200 -0.224801 -0.227151 -0.672296 -0.673236 0.215585 0.235649 0.205001 0.230174 0.271575 0.239691 0.292971 0.237738 0.275309 0.231872 0.226444 0.224682 0.227286 0.229367 0.228103 0.225698 0.226689 0.211720 0.230430 0.230714 0.228834 0.230955 0.209551
chargesum: 0.00000
title: Mulliken charges with hydrogens summed into heavy atoms:
elementType: O O O O N C C C C C C C C C C C C C C C C
charge: -0.266863 -0.265987 -0.242656 -0.252176 -0.124171 0.087093 -0.066703 0.020233 0.022820 0.440425 0.267356 -0.093704 -0.218971 0.254461 -0.003127 0.005305 -0.017914 0.232669 0.225237 0.000568 -0.003896
polarizability: 2.18219320e+02 -1.63580526e+01 1.84743422e+02 4.11496852e-01 -2.72832230e-01 1.72669522e+02
1716.lowfreq: -5.5085 -4.6248 -0.0005 -0.0004 -0.0002 1.8860 10.5400 14.7066 19.9140
frequency: 10.1594 14.6567 19.8907 22.9790 35.0522 38.5863 49.9372 59.2373 63.7020 87.2125 106.6014 114.5047 141.2643 157.2815 172.0121 199.3584 204.5638 240.0269 250.2172 252.6707 285.1794 295.6365 317.1502 346.2438 366.6220 405.9020 427.8986 434.8674 453.5504 498.5009 549.8947 561.5740 601.9427 616.2401 687.1653 693.7284 706.1672 744.3582 771.0806 797.5074 798.5719 798.9270 808.8864 819.5810 860.7361 864.0666 907.6459 918.5850 919.6517 969.9468 983.4026 987.6218 990.2581 1006.9214 1021.0397 1023.2531 1025.0690 1034.0547 1067.6948 1077.8145 1110.3621 1111.6506 1116.7158 1125.3758 1135.0530 1136.3494 1148.9401 1160.2444 1169.9916 1179.4360 1207.6565 1210.6861 1245.8878 1250.5926 1256.7694 1272.7348 1296.3071 1302.6179 1326.6433 1350.7552 1355.4163 1364.3116 1368.7786 1380.5033 1390.9244 1400.0246 1401.4514 1437.9410 1440.3682 1445.4297 1463.1273 1463.7370 1467.7907 1471.5957 1474.1639 1474.2531 1482.4536 1486.9445 1487.1412 1593.6795 1613.7768 1630.8123 1645.1704 2850.3166 2878.9410 2928.5388 2992.8559 2994.9962 2996.0340 3005.6267 3008.4173 3009.3516 3030.2197 3054.0952 3066.1787 3067.9283 3073.9915 3091.4404 3092.8228 3106.8474 3107.6343 3110.3948 3122.9161 3134.9659 3145.8525 3161.0409
redmass: 4.3085 4.0082 4.5911 4.8868 3.5293 3.4176 3.6000 5.3116 2.4006 3.2272 3.3890 3.4937 2.6859 2.0081 3.8606 3.7541 3.5247 3.1819 1.2320 1.3778 3.2871 2.8980 4.7185 3.3903 3.3056 2.8572 3.8008 4.1795 2.9023 3.1760 3.5977 2.7727 5.2934 6.3206 5.8013 5.5831 2.2193 1.4850 1.4034 1.1158 1.1725 3.0189 3.4979 3.5687 1.5083 2.9241 3.0589 1.9099 3.2868 2.3200 1.5159 1.7736 4.1642 1.4546 2.2785 2.2446 2.2807 2.1398 4.3130 1.5827 2.4341 2.3647 2.1999 3.1861 1.4649 1.4733 2.0682 1.7987 1.0610 1.1238 1.8217 1.5110 1.1402 1.1337 1.3639 1.6537 1.3155 1.5918 1.4073 1.3632 1.3941 1.5358 2.0926 1.5427 2.8254 1.2700 1.2676 1.5070 1.0848 1.4037 1.0403 1.0402 1.1839 1.0949 1.0597 1.0595 1.9549 1.0692 1.0693 6.1487 6.0847 9.7703 9.6722 1.0716 1.0704 1.0708 1.0858 1.0358 1.0358 1.0604 1.0582 1.0581 1.0855 1.0936 1.1066 1.1067 1.0972 1.0985 1.0985 1.1024 1.1026 1.0873 1.0861 1.0912 1.0957 1.1014
irintensity: 0.9784 0.4443 0.1492 0.1529 0.2642 0.0223 0.7429 1.4694 0.4745 1.1046 1.3516 2.5449 4.7253 8.2945 0.6820 10.3836 2.2791 6.2561 1.0974 3.7469 6.8083 1.6223 10.8280 10.3312 4.9370 0.1636 1.3268 2.6472 16.1670 6.6824 2.2325 2.4392 1.2565 0.2256 9.9461 3.8091 31.1381 72.1185 12.5513 3.4362 4.5952 4.7574 7.4385 3.8097 2.8742 11.4605 14.1427 7.9299 26.1441 30.6265 6.2020 18.3534 7.5103 17.1637 63.6808 8.2613 42.1156 63.8339 82.2625 19.4834 187.4833 20.7683 136.6989 302.3144 8.2402 9.1434 147.1725 46.1358 0.5514 1.5130 0.4981 14.3494 0.3311 0.0505 26.2428 2.3064 25.7586 114.4180 21.0312 7.4911 0.6608 6.1449 4.2708 49.5080 3.9326 16.4191 21.0368 28.5429 25.0189 7.1571 11.6322 11.9388 14.4728 10.9906 3.9852 5.7071 11.2837 12.5557 13.6103 0.8245 6.4174 150.2512 188.4971 86.9735 80.5358 65.9271 22.0586 23.3279 21.3587 11.0751 21.1685 18.7250 7.9517 4.1328 8.6422 8.0088 24.2581 32.7057 29.3005 44.8863 42.2030 9.1541 0.2720 15.9517 30.6503 29.1784
temp: 298.150 k
press: 1.00000 atm
elementType: 8 8 8 8 7 6 6 6 6 6 6 6 6 6 6 6 6 6 6 6 6 1 1 1 1 1 1 1 1 1 1 1 1 1 1 1 1 1 1 1 1 1 1 1
symmnumber: 1
zpe: 954445.5 jmol-1
zpe.correction: 0.363529 hartree
zpe.thermalcorrener: 0.386892 hartree
zpe.thermalcorrenthalpy: 0.387837 hartree
zpe.thermalcorrgfe: 0.303975 hartree
zpe.sumelectzpe: -977.527389 hartree
zpe.sumelectthermal: -977.504025 hartree
zpe.sumelectthermalent: -977.503081 hartree
zpe.sumelectthermalfe: -977.586943 hartree
dipole: 1.1266 0.0321 0.0109
dipole: 1.1272
quadrupole: -110.3361 -115.3768 -123.1767
quadrupole: 7.0718 -3.7421 6.1562
quadrupole: 5.9605 0.9197 -6.8802 7.0718 -3.7421 6.1562
hfenergy: -977.8909178 hartree
pointgroup: C01[X(C16H23N1O4)]
dipole: -0.431874 -0.1006516 -0.0030469 debye
polarizability: 223.2689733|-8.5206031|179.6857434|0.8485334|-0.1568619|172.6775474 unknown
InChI: InChI=1S/C16H23NO4/c1-3-20-15(18)10-11-17(13-16(19)21-4-2)12-14-8-6-5-7-9-14/h5-9H,3-4,10-13H2,1-2H3
charge 0 multiplicity 1
44 atoms
O  -1.249523 -3.45713 -0.206449
O  4.279946 1.378282 0.457704
O  0.205867 -2.092628 1.000074
O  4.13596 -0.242509 -1.2105
N  -0.199295 0.007259 -0.915877
C  1.244763 -0.068465 -1.221918
C  -0.886945 1.217188 -1.400274
C  -0.952419 -1.236183 -1.039117
C  2.083446 0.581683 -0.100347
C  -2.123337 1.58838 -0.581128
C  -0.575705 -2.258987 0.037877
C  -2.153783 1.373056 0.820215
C  -3.239756 2.196574 -1.206277
C  3.572806 0.50355 -0.373149
C  -3.275882 1.76878 1.581079
C  -4.362629 2.597179 -0.445988
C  -4.383581 2.385248 0.951812
C  -1.010105 -4.561858 0.77462
C  5.770181 1.349161 0.32711
C  -1.845183 -5.75069 0.311252
C  6.318581 2.355724 1.333421
H  1.481779 0.406556 -2.200324
H  1.547973 -1.125319 -1.31356
H  -1.173917 1.146414 -2.480334
H  -0.156693 2.048512 -1.334512
H  -2.030702 -1.021985 -0.914599
H  -0.850786 -1.743002 -2.029793
H  1.860811 0.045646 0.84192
H  1.798756 1.636701 0.064919
H  -1.293966 0.883348 1.29167
H  -3.231313 2.357329 -2.292213
H  -3.287656 1.597176 2.663661
H  -5.219354 3.067044 -0.942615
H  -5.254309 2.691657 1.542627
H  0.072688 -4.782136 0.789743
H  -1.302051 -4.202857 1.778218
H  6.03333 1.603563 -0.715728
H  6.116458 0.318446 0.525301
H  -1.706847 -6.598605 1.006713
H  -1.541915 -6.076497 -0.698352
H  -2.91773 -5.492968 0.286304
H  5.944322 3.371386 1.118987
H  6.021077 2.085943 2.361128
H  7.42274 2.373336 1.283302
