program: Gaussian 09
title: 000069901
version: EM64L-G09RevD.01
frameworkgroup: C1[X(C9H7Cl3O3)]
method: RPBEPBE
basis: SDD
operation: Freq
keyword: #p
keyword: freq=noraman
keyword: PBEPBE/SDD
title: #p freq=noraman PBEPBE/SDD
converged: YES YES NO NO
title: Mulliken charges:
elementType: Cl Cl Cl O O O C C C C C C C C C H H H H H H H
charge: -0.014318 0.015197 -0.030423 -0.268087 -0.409643 -0.234790 -0.268825 -0.481039 0.561422 -0.232332 -0.249407 -0.233803 -0.224084 -0.087649 0.219563 0.247072 0.226897 0.242266 0.272061 0.285085 0.285529 0.379309
chargesum: 0.00000
title: Mulliken charges with hydrogens summed into heavy atoms:
elementType: Cl Cl Cl O O O C C C C C C C C C
charge: -0.014318 0.015197 -0.030423 -0.268087 -0.030334 -0.234790 0.205144 0.033287 0.561422 -0.232332 -0.249407 0.051282 0.061444 -0.087649 0.219563
polarizability: 1.87249963e+02 -2.29956224e+00 1.50744122e+02 7.45443913e+00 -6.65793442e-01 6.85912557e+01
1716.lowfreq: -7.6035 -4.9796 -0.0016 -0.0015 0.0016 5.7566 12.7113 30.6353 40.7754
frequency: 12.0159 30.6126 40.7110 52.4811 76.4705 121.6667 163.6873 172.4046 177.7317 195.8613 227.6759 261.4479 284.9974 347.3638 360.5213 403.0779 407.5487 474.8864 504.0410 508.6141 541.4517 559.9959 599.8003 655.7999 669.3546 738.2335 754.9982 788.5903 794.3830 852.9765 860.7358 880.5876 976.8802 1011.5409 1043.2618 1050.4538 1103.0335 1107.1669 1178.9904 1187.3236 1222.1819 1232.8516 1269.2790 1338.3139 1361.1566 1371.1093 1378.1736 1426.9211 1428.1998 1469.7237 1551.2761 1572.6180 1671.2446 2997.4897 3013.3142 3067.9886 3102.0279 3185.9810 3187.3825 3512.2836
redmass: 7.1962 9.0539 10.1201 6.6327 8.0429 13.1033 8.5057 22.6389 7.9634 4.9311 2.8976 9.7872 4.5124 25.4236 5.8019 5.5044 7.9564 4.0743 5.0217 2.7065 6.9364 3.9486 2.3665 2.2147 2.8999 7.7733 10.7941 6.0172 3.1773 1.4095 1.3616 4.9423 3.2230 1.6965 2.9776 3.1212 2.2625 2.7005 1.5077 1.1461 2.3474 1.4315 1.6696 5.5207 1.4181 4.4916 1.8879 2.9001 1.0923 1.0993 9.5991 7.8792 8.4105 1.0564 1.0655 1.1095 1.0955 1.0933 1.0940 1.0639
irintensity: 0.4535 0.5184 1.9887 1.5447 0.9844 0.4490 1.0940 0.1022 0.6955 0.1320 4.8091 2.2958 2.3942 0.2609 1.4503 13.9444 5.6408 10.0635 0.0760 45.8470 5.6677 8.7854 40.4237 31.3340 131.2369 47.3377 76.3358 35.1601 3.4726 41.4076 1.2986 13.6536 66.2777 11.5874 134.5380 64.7715 147.8810 9.8237 3.9549 5.5420 91.9028 24.2244 5.1925 17.9204 19.3490 21.1824 110.2605 162.4041 30.5940 6.2734 60.1729 43.5435 189.4424 24.9443 12.6248 10.1200 4.2558 2.2887 0.6244 27.8127
temp: 298.150 k
press: 1.00000 atm
elementType: 17 17 17 8 8 8 6 6 6 6 6 6 6 6 6 1 1 1 1 1 1 1
symmnumber: 1
zpe: 374065.6 jmol-1
zpe.correction: 0.142474 hartree
zpe.thermalcorrener: 0.157742 hartree
zpe.thermalcorrenthalpy: 0.158686 hartree
zpe.thermalcorrgfe: 0.095972 hartree
zpe.sumelectzpe: -1951.889881 hartree
zpe.sumelectthermal: -1951.874613 hartree
zpe.sumelectthermalent: -1951.873669 hartree
zpe.sumelectthermalfe: -1951.936383 hartree
dipole: -0.8250 1.3191 0.8983
dipole: 1.7966
quadrupole: -99.7769 -106.1504 -108.2197
quadrupole: -2.1798 0.6563 6.0773
quadrupole: 4.9388 -1.4347 -3.5041 -2.1798 0.6563 6.0773
hfenergy: -1952.0323553 hartree
pointgroup: C01 [X(C9H7Cl3O3)]
dipole: 0.3286656 0.4771068 -0.4049265 debye
dipolederiv: -0.181054 -0.1687039 0.0082068 -0.1706788 -0.6793184 0.0276362 0.026005 0.0443582 -0.0426466 -0.3393064 0.2750724 -0.0579311 0.3182509 -0.4391359 0.0770048 -0.0516429 0.0700955 -0.0333543 -0.8339062 -0.1406254 -0.0221082 -0.146973 -0.156311 0.0039944 -0.0377882 0.0014367 -0.0530065 -1.5085891 -0.202722 0.2510396 -0.3137737 -0.3557917 0.0574782 0.2577527 0.0524122 -0.353643 -0.9350378 -0.1537594 -0.4213018 -0.0465715 -0.2380761 -0.0370403 -0.5219752 -0.1036141 -0.8426049 -0.5981886 0.0957192 -0.1296751 -0.0883549 -0.7865966 -0.2908771 -0.2191327 -0.1046264 -0.5373241 0.8087538 0.0575294 -0.2174506 0.1581932 0.2896711 -0.0528383 -0.4995345 -0.119989 0.4840776 -0.1402994 0.0315161 -0.0708417 0.1016354 -0.1621581 0.0696962 -0.1113171 0.0849342 0.0143333 1.0351838 0.2264297 -0.1367337 0.3116775 -0.2398811 0.0250146 0.1008643 0.0604724 0.021076 0.1850008 0.1899074 0.0368119 0.2517877 0.9925826 -0.0512292 -0.025657 -0.0858925 -0.0554537 0.4561018 -0.3951154 0.1201885 -0.5106222 0.6823095 -0.1217909 0.1073398 -0.0945865 -0.0511386 -0.4052306 -0.1354216 0.0034126 -0.1643754 -0.2861802 0.0088538 -0.0030921 0.0143676 -0.0718324 -0.4937262 0.0715853 -0.0269568 0.073935 -0.1730746 0.0231237 -0.0291156 0.0164562 -0.0689701 1.2295629 0.1933272 0.0511777 0.2151181 0.2892904 -0.0255236 0.0672472 -0.0215448 -0.0578224 1.070038 -0.0594596 0.6271824 -0.0933181 1.0013966 0.2754861 0.8089671 0.1585602 0.9409493 0.0367106 -0.0440932 0.013884 -0.0523367 -0.017295 -0.1170136 0.0845542 -0.0200569 -0.0179826 -0.0188224 0.0725613 -0.0370631 0.0125507 -0.0394108 0.119241 0.0488161 0.0651899 -0.0191626 -0.0036655 -0.0077564 0.0638638 0.0077984 0.0844171 0.0388995 0.0794621 0.0634998 0.0061604 0.1091838 0.0302822 -0.0215456 0.0277446 0.034879 -0.0612558 -0.045257 -0.08734 0.0329607 0.0643288 0.0338821 -0.0080815 0.0361112 0.0622603 0.0130773 -0.0088566 0.0131715 0.1731447 0.0886826 -0.0212459 -0.0006529 -0.025353 0.0367553 0.0124463 -0.0055622 0.0122717 0.1716741 0.3742794 0.0510904 -0.0254252 0.0975546 0.0996675 0.0056168 -0.0220773 -0.0195759 0.3605657 unknown
polarizability: 187.312337|2.7054088|149.9662725|7.0268772|-7.7810431|69.3067315 unknown
InChI: InChI=1S/C9H7Cl3O3/c10-5-3-6(11)9(7(12)4-5)15-2-1-8(13)14/h3-4,13H,1-2H2
charge 0 multiplicity 1
22 atoms
Cl -0.949118 2.992761 -0.135231
Cl 0.160545 -2.433623 0.436643
Cl -5.08666 -0.704275 -0.074828
O  0.816268 0.525341 0.286626
O  4.660706 -0.080121 0.888727
O  3.56267 -1.45103 -0.630323
C  1.589815 0.723341 -0.978491
C  3.034917 0.96438 -0.549951
C  -0.542406 0.243391 0.131343
C  -1.509745 1.269374 -0.03146
C  -1.027141 -1.08798 0.22608
C  -2.891122 1.007052 -0.096767
C  -2.400739 -1.395141 0.168996
C  -3.310014 -0.333426 0.004644
C  3.733001 -0.318905 -0.130482
H  1.50358 -0.186943 -1.600562
H  1.184123 1.600744 -1.515399
H  3.599841 1.381513 -1.40696
H  3.078274 1.701715 0.26713
H  -3.610715 1.820027 -0.216503
H  -2.744703 -2.428748 0.248664
H  5.118623 -0.932945 1.123903
