program: Gaussian 09
title: 000075051
version: EM64L-G09RevD.01
frameworkgroup: C1[X(C20H17OP)]
method: RPBEPBE
basis: SDD
operation: Freq
keyword: #p
keyword: freq=noraman
keyword: PBEPBE/SDD
title: #p freq=noraman PBEPBE/SDD
converged: YES YES NO NO
title: Mulliken charges:
elementType: P O C C C C C C C C C C C C C C C C C C C C H H H H H H H H H H H H H H H H H
charge: 0.722480 -0.284883 -0.060754 -0.074705 -0.020157 -0.574374 -0.292273 -0.271110 -0.306533 -0.265363 -0.287728 -0.311299 -0.222933 -0.234124 -0.235063 -0.226912 -0.228943 -0.220730 -0.095270 -0.224880 -0.221608 -0.223995 0.270170 0.262910 0.262572 0.268418 0.265353 0.292133 0.283060 0.236190 0.235305 0.235768 0.237750 0.240615 0.239074 0.124020 0.236385 0.235940 0.235493
chargesum: 0.00000
title: Mulliken charges with hydrogens summed into heavy atoms:
elementType: P O C C C C C C C C C C C C C C C C C C C C
charge: 0.722480 -0.284883 -0.060754 -0.074705 -0.020157 -0.304204 -0.029363 -0.008538 -0.038115 -0.000010 0.004405 -0.028239 0.013257 0.001181 0.000705 0.010838 0.011672 0.018344 0.028750 0.011505 0.014332 0.011498
polarizability: 2.55784919e+02 -4.22047800e+00 2.46649947e+02 1.30262425e+01 1.11884175e+01 2.34208928e+02
1716.lowfreq: -3.3017 -3.1197 -0.0016 -0.0014 -0.0003 11.7489 14.3268 33.5945 42.7097
frequency: 14.1965 33.5590 42.6253 50.0487 53.7653 64.7247 66.8857 70.0121 155.5172 180.3206 183.5747 199.3381 228.5161 242.3761 243.1169 258.8093 275.5738 337.9741 395.1166 398.1106 402.1901 432.2164 447.3483 464.1171 502.7535 511.5693 539.6897 611.3251 612.1796 613.2013 654.7231 668.0195 686.3411 691.6875 698.9297 699.9992 703.1931 755.4888 757.5917 762.3659 856.5483 862.5086 866.2196 872.0184 930.8315 936.2111 942.3331 974.0634 982.5692 984.6619 986.5140 987.4229 987.6121 992.1329 1003.0030 1004.8165 1007.2864 1017.8874 1019.3037 1020.2411 1074.1389 1080.5274 1080.9695 1081.4876 1083.1748 1091.8391 1165.8762 1175.4012 1175.8995 1176.2317 1191.4283 1192.8354 1194.2714 1238.6320 1311.4027 1312.8864 1314.7349 1375.1538 1377.6849 1378.3132 1382.2318 1424.4801 1426.7247 1427.7268 1465.6557 1466.4400 1467.8623 1580.6529 1584.3774 1585.6876 1586.6706 1592.4543 1593.7923 1595.5877 2762.9664 3122.5593 3130.1344 3130.3647 3130.4822 3135.7873 3136.1088 3138.8820 3145.5682 3146.1454 3151.3894 3156.2384 3156.7331 3166.7489 3168.9809 3169.5763 3170.4207
redmass: 3.7774 4.0255 5.0036 5.3406 4.4624 6.9480 6.6370 5.2446 2.1224 4.8459 4.6329 4.4894 5.4047 5.5471 5.1674 5.0624 4.7320 6.1398 2.7999 2.8059 2.8623 5.8048 4.8935 4.5430 5.2739 4.6469 7.1612 6.4623 6.4653 6.4659 1.4179 6.4616 5.3673 5.8371 2.0947 2.2833 2.1008 1.5428 1.4657 1.5978 1.2516 1.2446 1.4144 3.0350 1.3653 1.3638 1.3446 1.4780 1.4263 1.9918 6.0439 2.5914 5.7458 1.3790 1.3237 1.3257 1.3222 3.3674 3.3073 3.0484 2.2594 1.9288 1.7958 1.9785 1.6730 2.6407 1.4860 1.0550 1.0556 1.0541 1.1256 1.1251 1.1244 2.9230 1.3358 1.3272 1.3186 7.4556 7.1054 8.4794 1.5449 2.1000 2.1157 2.1199 2.0108 2.0286 2.0356 4.4831 5.8459 5.9898 5.8312 5.7740 5.7719 5.8595 1.0796 1.0867 1.0855 1.0858 1.0867 1.0882 1.0883 1.0916 1.0921 1.0920 1.0959 1.0966 1.0959 1.1014 1.1015 1.1006 1.0902
irintensity: 0.1998 0.4281 1.2110 0.6402 0.7004 2.7539 3.7481 1.3392 3.3289 0.7474 2.1352 3.8470 0.7047 1.8757 0.3773 0.5607 1.9578 4.4297 0.4348 0.2858 0.1763 2.9674 8.7235 7.1106 72.4695 56.6767 83.3917 0.2065 0.3757 0.9111 29.8858 6.7687 28.4048 2.8129 32.7674 48.3066 43.0553 47.4401 34.1655 48.9517 0.1236 0.4459 7.2688 29.6646 0.1082 1.0289 0.4122 2.1600 0.1460 0.4033 3.9296 3.5696 0.1706 0.1086 0.0728 0.1897 0.1585 1.5277 1.9270 7.1070 46.5798 10.3183 8.8351 9.2168 1.9075 5.8334 62.4961 0.0685 0.0894 0.1237 8.8503 7.5615 1.1888 105.3512 4.2443 2.6842 4.5561 0.3688 6.6512 0.6133 48.2177 22.6074 10.8021 28.5517 13.2782 9.5148 21.8320 378.6746 11.4219 0.4631 36.0717 3.8373 6.0036 5.4873 170.7383 1.8898 0.4032 0.7812 0.7865 1.8171 1.7205 3.3673 6.8913 3.8307 19.7237 18.6615 16.3345 37.2413 36.9437 18.8838 1.1571
temp: 298.150 k
press: 1.00000 atm
elementType: 15 8 6 6 6 6 6 6 6 6 6 6 6 6 6 6 6 6 6 6 6 6 1 1 1 1 1 1 1 1 1 1 1 1 1 1 1 1 1
symmnumber: 1
zpe: 797404.3 jmol-1
zpe.correction: 0.303715 hartree
zpe.thermalcorrener: 0.323653 hartree
zpe.thermalcorrenthalpy: 0.324597 hartree
zpe.thermalcorrgfe: 0.252434 hartree
zpe.sumelectzpe: -1187.197820 hartree
zpe.sumelectthermal: -1187.177882 hartree
zpe.sumelectthermalent: -1187.176938 hartree
zpe.sumelectthermalfe: -1187.249102 hartree
dipole: -2.9902 -1.9593 -8.8767
dipole: 9.5695
quadrupole: -121.0219 -119.3713 -163.4746
quadrupole: -5.0684 -14.6537 -7.3894
quadrupole: 13.6007 15.2513 -28.8520 -5.0684 -14.6537 -7.3894
hfenergy: -1187.5015351 hartree
pointgroup: C01 [X(C20H17O1P1)]
dipole: 1.1080416 0.8077247 3.5063624 debye
polarizability: 247.2662382|-3.281397|254.639674|11.6134659|13.5311811|234.7378815 unknown
InChI: InChI=1S/C20H17OP/c21-16-17-22(18-10-4-1-5-11-18,19-12-6-2-7-13-19)20-14-8-3-9-15-20/h1-17H
charge 0 multiplicity 1
39 atoms
P  -0.032374 -0.025981 -0.666602
O  -1.433559 -1.209963 -4.245324
C  1.537851 0.916987 -0.319719
C  0.088463 -1.696533 0.184241
C  -1.388486 0.907474 0.260012
C  -0.242689 -0.169897 -2.420103
C  2.65266 0.285531 0.279705
C  -0.344203 -1.89278 1.517144
C  -1.133537 1.546328 1.497824
C  1.613026 2.277076 -0.713787
C  0.64975 -2.768721 -0.551472
C  -2.677627 0.958368 -0.318528
C  3.845302 1.01638 0.483922
C  -0.206276 -3.165353 2.116613
C  -2.177097 2.231997 2.160538
C  2.809814 2.999244 -0.512021
C  0.786466 -4.037664 0.054123
C  -3.719994 1.637188 0.352496
C  -1.203386 -1.063162 -2.994739
C  3.926894 2.370776 0.0871
C  0.360988 -4.237062 1.3884
C  -3.47198 2.272046 1.592055
H  0.379577 0.480932 -3.04121
H  2.595613 -0.765524 0.582617
H  -0.804145 -1.073201 2.078828
H  -0.126802 1.53147 1.932303
H  0.746893 2.768512 -1.171153
H  0.957337 -2.604182 -1.590684
H  -2.855495 0.497115 -1.296983
H  4.707759 0.526179 0.948211
H  -0.54779 -3.320071 3.145848
H  -1.979244 2.735039 3.113472
H  2.868558 4.048259 -0.82136
H  1.214165 -4.86786 -0.517918
H  -4.718708 1.676383 -0.095556
H  -1.778282 -1.684052 -2.24765
H  4.85392 2.933296 0.243194
H  0.461589 -5.223514 1.854547
H  -4.279847 2.804141 2.106616
