program: Gaussian 09
title: 000069872
version: EM64L-G09RevD.01
frameworkgroup: C1[X(C10H10N2)]
method: RPBEPBE
basis: SDD
operation: Freq
keyword: #pfreq=noraman
keyword: PBEPBE/SDD
title: #p freq=noraman PBEPBE/SDD
converged: NO YES NO NO
title: Mulliken charges:
elementType: N N C C C C C C C C C C H H H H H H H H H H
charge: -0.708337 -0.708333 0.444883 0.444885 -0.655042 -0.655042 0.346624 0.346614 -0.443313 -0.443312 -0.253478 -0.253478 0.217222 0.217222 0.233417 0.233417 0.219253 0.219253 0.288019 0.310754 0.288017 0.310754
chargesum: 0.00000
title: Mulliken charges with hydrogens summed into heavy atoms:
elementType: N N C C C C C C C C C C
charge: -0.109563 -0.109562 0.444883 0.444885 -0.437821 -0.437820 0.346624 0.346614 -0.209896 -0.209895 -0.034225 -0.034225
polarizability: 2.15419821e+02 -2.51618217e-05 1.28286869e+02 -2.74676174e-03 2.26169318e-02 4.94569247e+01
1716.lowfreq: -448.1713 -0.0007 -0.0005 0.0001 4.8477 6.5204 12.5421 112.2089 122.5410
frequency: -448.1703 112.2064 122.5410 200.7823 262.9317 267.0223 318.3553 347.3797 366.4640 374.4120 407.6444 442.9632 443.2089 477.1172 535.9595 559.3264 622.9107 667.9179 706.8601 736.6923 747.6778 772.0208 829.8918 833.8497 859.2660 898.5366 904.1217 946.8683 973.7079 1020.7448 1022.0424 1057.0593 1117.3883 1168.0129 1194.9866 1212.3399 1275.4274 1283.4116 1338.2888 1347.7950 1416.0766 1434.2359 1452.1644 1490.9049 1548.2521 1579.3902 1603.4409 1628.5009 1653.4153 1679.5238 3105.2104 3108.2105 3109.1451 3114.4911 3133.5202 3154.9788 3583.8934 3588.6217 3720.8900 3726.6073
redmass: 1.0428 4.2565 5.2699 1.2388 3.9716 3.7223 1.8235 3.2767 1.1575 1.4838 4.9223 2.9546 6.6315 2.7245 3.3205 3.6436 6.6512 5.4325 4.3494 5.8147 1.2489 2.1169 2.9638 1.3993 1.4597 2.2305 4.9665 1.4036 1.3274 2.2567 1.6329 1.3194 1.8097 1.0719 1.5532 1.4395 2.0620 2.1161 3.3503 1.8234 7.7518 3.5838 3.2007 3.6330 4.9890 7.3903 2.7003 2.0484 3.3445 1.1242 1.0901 1.0912 1.0855 1.0883 1.0940 1.1002 1.0460 1.0467 1.1028 1.1007
irintensity: 0.0786 0.0003 0.2480 251.7434 0.0003 3.1622 216.2228 0.9288 0.0153 160.3850 0.3332 0.8498 0.0784 29.8511 0.3838 0.0000 5.8822 0.3473 0.0000 1.7247 55.2010 0.0000 7.4726 0.0012 100.0986 0.0000 0.2068 12.4886 0.0000 12.7314 2.5435 9.5082 0.1140 1.3673 38.4595 3.0773 0.0073 20.9385 166.7060 1.3305 6.1346 0.0292 0.1423 57.2746 369.1984 0.0998 2.9961 19.3184 99.6180 243.2918 28.4361 8.2632 21.9059 2.4302 43.1070 43.0584 34.4713 88.0623 19.0084 11.7287
temp: 298.150 k
press: 1.00000 atm
elementType: 7 7 6 6 6 6 6 6 6 6 6 6 1 1 1 1 1 1 1 1 1 1
symmnumber: 1
zpe: 464196.6 jmol-1
zpe.correction: 0.176803 hartree
zpe.thermalcorrener: 0.186756 hartree
zpe.thermalcorrenthalpy: 0.187700 hartree
zpe.thermalcorrgfe: 0.142202 hartree
zpe.sumelectzpe: -495.742799 hartree
zpe.sumelectthermal: -495.732846 hartree
zpe.sumelectthermalent: -495.731902 hartree
zpe.sumelectthermalfe: -495.777400 hartree
dipole: -4.6148 0.0000 0.0029
dipole: 4.6148
quadrupole: -49.6828 -56.6157 -79.0550
quadrupole: 0.0000 -0.0120 -0.0286
quadrupole: 12.1017 5.1688 -17.2705 0.0000 -0.0120 -0.0286
hfenergy: -495.9196024 hartree
pointgroup: C01 [X(C10H10N2)]
dipole: -1.8156077 -0.0000383 0.001136 debye
dipolederiv: -1.3556123 0.5064311 0.0023797 0.7826528 -0.4242391 0.0015939 0.0055472 -0.0000193 -0.7529694 -1.3555545 -0.506469 -0.0029117 -0.7826844 -0.4242937 0.0016631 -0.0073306 -0.0003533 -0.7529549 0.1056081 -0.1819849 -0.0000678 -0.2873227 -0.0947052 0.0000091 -0.0002617 0.0001541 0.0421981 0.1055811 0.1819906 0.0000284 0.2873308 -0.0946861 0.0000016 0.0002689 0.0001886 0.0421981 -0.3325854 0.2107818 -0.0000471 -0.1028112 0.0881867 -0.0000137 -0.0013535 0.0003761 -0.256824 -0.3325722 -0.2107963 0.0000286 0.1027915 0.0881804 -0.0000287 0.00151 0.0004642 -0.2568243 1.241811 -0.5761304 -0.0001199 -1.0955845 0.2588451 -0.0007318 -0.0002468 -0.0011598 0.0978431 1.2417302 0.5761678 0.0003873 1.0956264 0.2589171 -0.0006956 0.0005508 -0.0011295 0.0978387 0.1291899 0.0816775 0.0000084 0.0519316 0.1188702 0.0001887 0.0002352 -0.0000568 -0.1965763 0.1291999 -0.0816755 0.0000015 -0.051934 0.1188649 0.0001919 -0.0002524 -0.0000543 -0.1965753 -0.1378482 0.0428665 -0.0000045 0.1912227 0.0239717 0.0001047 0.0001344 0.0000689 -0.1897742 -0.1378409 -0.0428747 -0.000014 -0.191229 0.0239591 0.0000919 -0.0001486 0.0000679 -0.1897745 0.052554 0.0088837 0.0000644 0.0561003 -0.1439784 0.0000968 -0.0000144 0.0001265 0.1653714 0.0525568 -0.0088746 -0.0000582 -0.0560915 -0.1439805 0.000115 0.0000296 0.0001192 0.1653716 0.0732778 0.0381695 0.0000213 -0.0387523 -0.1393494 -0.0001468 -0.0000392 -0.0001104 0.1570222 0.0732781 -0.0381598 -0.000016 0.0387621 -0.1393498 -0.0001504 0.0000463 -0.0001069 0.157022 -0.1165743 -0.1033625 -0.0000492 -0.1105523 0.0267039 -0.000067 -0.0000591 -0.0000202 0.1652851 -0.1165841 0.1033562 0.0000645 0.1105456 0.0267135 -0.0000721 0.0000747 -0.0000275 0.1652851 0.1776069 -0.0522048 -0.0009996 -0.0611479 0.1410877 -0.0008966 -0.004163 -0.000153 0.3845007 0.1625895 -0.0561656 -0.0007701 -0.0761068 0.1445925 -0.0001009 -0.0008399 0.0007539 0.3839239 0.1776023 0.052205 0.001215 0.0611468 0.1410927 -0.0010907 0.0050875 -0.0001509 0.3844922 0.1625861 0.0561687 0.000859 0.0761062 0.1445968 -0.0000624 0.0012244 0.0010224 0.3839206 unknown
polarizability: 215.4198211|0.0019137|128.2868688|-0.0027473|0.0226169|49.4569247 unknown
InChI: InChI=1S/C10H10N2/c11-9-5-7-3-1-2-4-8(7)6-10(9)12/h1-6H,11-12H2
charge 0 multiplicity 1
22 atoms
N  -3.069457 1.438079 -0.000986
N  -3.069396 -1.438207 0.000881
C  0.621013 0.72494 0.00043
C  0.621047 -0.724908 -0.000419
C  -0.633634 1.409325 0.000488
C  -0.633573 -1.409349 -0.000379
C  -1.85873 0.727483 -0.000067
C  -1.8587 -0.727557 0.00021
C  1.875768 1.418073 0.000745
C  1.875831 -1.417982 -0.000802
C  3.085359 0.715582 0.000317
C  3.08539 -0.715438 -0.000436
H  -0.635449 2.507682 0.000448
H  -0.635338 -2.507705 -0.000358
H  1.874901 2.51541 0.001293
H  1.875014 -2.515319 -0.001357
H  4.037365 1.258596 0.000556
H  4.037421 -1.258408 -0.000728
H  -3.97941 0.994062 -0.007291
H  -3.050084 2.453426 -0.000985
H  -3.979362 -0.994233 0.008429
H  -3.049975 -2.453553 0.001214
